program: Gaussian 09
title: 000227798
version: EM64L-G09RevD.01
frameworkgroup: C1[X(C6H8O3)]
method: RPBEPBE
basis: SDD
operation: Freq
keyword: #p
keyword: freq=noraman
keyword: PBEPBE/SDD
title: #p freq=noraman PBEPBE/SDD
converged: YES YES NO NO
title: Mulliken charges:
elementType: O O O C C C C C C H H H H H H H H
charge: -0.182179 -0.416357 -0.224235 -0.193147 -0.441712 -0.522690 -0.515641 0.152957 0.156707 0.276540 0.233250 0.248182 0.272469 0.257139 0.259661 0.260677 0.378379
chargesum: 0.00000
title: Mulliken charges with hydrogens summed into heavy atoms:
elementType: O O O C C C C C C
charge: -0.182179 -0.037978 -0.224235 0.083393 0.039720 0.006917 0.004697 0.152957 0.156707
polarizability: 8.04668818e+01 -4.60694865e+00 6.47154912e+01 -1.04806424e+00 1.13221853e+00 5.90240467e+01
1716.lowfreq: -12.7555 -0.0006 0.0004 0.0007 12.8682 23.0218 37.2244 55.9638 134.2142
frequency: 33.0874 55.8791 134.2049 229.7449 275.8933 364.5622 434.8036 457.4629 542.8540 561.8682 616.2978 682.4335 711.2973 731.3545 787.7233 816.0488 904.2857 929.6301 966.9587 995.6794 1044.1087 1076.5506 1130.3386 1146.2914 1160.9084 1177.1260 1235.8468 1251.7495 1265.8778 1281.8038 1311.4369 1368.1883 1417.8075 1434.7408 1477.9065 1659.0683 1670.0107 3000.8704 3010.6268 3016.4065 3066.7745 3083.0604 3085.9738 3093.2749 3510.5558
redmass: 8.2629 6.4824 2.9267 2.8868 2.4018 6.6733 2.2874 3.8781 4.0125 2.3673 1.4734 3.0424 2.8842 3.3029 3.4339 2.6270 2.2012 1.8127 1.9325 1.8180 2.6897 2.0779 1.5641 1.4154 2.5904 1.3866 1.3041 1.5923 1.4269 1.4660 1.4855 1.9196 1.0880 1.0834 1.0873 8.2495 12.1248 1.0652 1.0639 1.0636 1.0863 1.0968 1.0977 1.1027 1.0640
irintensity: 0.1521 3.4162 3.3956 3.1297 3.4536 6.7548 4.0030 7.4715 35.9000 21.4365 92.1028 16.3994 31.3949 4.2443 11.7550 7.4155 3.7694 3.0865 13.0806 23.2192 269.3530 44.9091 21.5651 8.3916 61.3385 1.8155 4.5644 4.4580 7.4883 10.0137 1.0666 41.4151 24.6658 21.1787 6.3805 180.5298 215.4614 5.0714 9.3747 25.7686 12.7695 9.3311 1.8616 19.8846 25.4681
temp: 298.150 k
press: 1.00000 atm
elementType: 8 8 8 6 6 6 6 6 6 1 1 1 1 1 1 1 1
symmnumber: 1
zpe: 348169.4 jmol-1
zpe.correction: 0.132611 hartree
zpe.thermalcorrener: 0.141083 hartree
zpe.thermalcorrenthalpy: 0.142027 hartree
zpe.thermalcorrgfe: 0.098093 hartree
zpe.sumelectzpe: -458.425784 hartree
zpe.sumelectthermal: -458.417312 hartree
zpe.sumelectthermalent: -458.416367 hartree
zpe.sumelectthermalfe: -458.460301 hartree
dipole: -3.0138 2.8414 1.1490
dipole: 4.2984
quadrupole: -58.5358 -55.0944 -50.0572
quadrupole: 5.6615 3.4226 -3.0547
quadrupole: -3.9733 -0.5319 4.5053 5.6615 3.4226 -3.0547
hfenergy: -458.5583945 hartree
pointgroup: C01 [X(C6H8O3)]
dipole: -1.1828729 -1.1425969 -0.3940028 debye
dipolederiv: -0.9446074 -0.2665328 -0.0848841 -0.2858284 -0.5232168 0.0461364 -0.1047399 0.0448012 -0.4141243 -1.1986977 -0.3424 -0.1086782 -0.3127411 -0.4509302 0.0442144 -0.0006367 0.0804564 -0.322327 -0.6454593 0.007608 0.0784383 -0.1801815 -0.7411017 -0.2242493 -0.0113347 -0.3500386 -0.4893514 -0.1305557 0.1098846 0.0750005 0.2329886 -0.1078301 -0.0593871 0.0355421 -0.0288734 0.0595887 0.144277 -0.0309684 -0.0269962 -0.0758876 0.1256224 0.0189523 0.1181755 -0.015279 0.0689976 -0.1454468 0.0111697 -0.2150858 0.0960044 -0.0363153 0.1586731 -0.2861299 0.123885 -0.2342466 -0.0746566 -0.131292 0.0043871 -0.1656932 -0.2096418 0.2391944 0.0762614 0.2787409 -0.190893 1.050964 0.318725 0.2429441 0.3210417 0.6102077 -0.3527134 0.2596898 -0.3527803 0.6442903 1.5502076 0.2122472 -0.0887266 0.2907594 0.9073015 0.4086495 -0.2007994 0.5109081 0.4602874 -0.0135064 -0.015744 -0.0733328 -0.0416484 0.0744825 -0.0401725 -0.0630077 -0.0424975 -0.0301176 0.014009 0.0948556 0.0381806 0.0694813 -0.0390453 -0.0886661 0.0040812 -0.1060636 -0.0237766 -0.0276095 -0.1049811 0.0602427 -0.069505 0.0263937 0.0539047 0.0642174 0.0731792 0.0177196 0.0698265 0.0161182 -0.0271405 -0.0068341 -0.0421345 0.0284659 -0.0131073 -0.0129205 0.1225456 0.0076672 0.010181 0.0582817 0.0066705 0.1041523 -0.0683497 0.0621832 -0.0269209 -0.024931 -0.0401122 0.0822738 -0.0582107 0.0572578 0.0219623 0.0457285 -0.0607597 0.0171526 0.0954847 0.0729105 -0.0030823 0.0656225 -0.0106949 0.0412453 -0.0791808 0.0312394 -0.0672772 0.0049932 0.31079 0.0319375 0.0599575 0.0748104 0.2388481 -0.1312003 0.0891252 -0.1264725 0.2558606 unknown
polarizability: 80.4053133|4.8007239|64.8691486|0.4828968|0.8671351|58.9319577 unknown
InChI: InChI=1S/C6H8O3/c7-5-2-1-4(3-5)6(8)9/h4,8H,1-3H2
charge 0 multiplicity 1
17 atoms
O  2.806019 0.783054 0.111665
O  -2.831744 -0.273352 0.018671
O  -1.374203 1.360873 0.789259
C  -0.562714 -0.379371 -0.786196
C  0.043967 -1.5848 0.031937
C  0.660937 0.509483 -1.107863
C  1.186681 -0.952622 0.856386
C  1.707816 0.198166 -0.020166
C  -1.577655 0.353039 0.076124
H  -1.084959 -0.750639 -1.682783
H  0.449177 -2.321081 -0.686149
H  -0.717089 -2.096905 0.643027
H  0.441408 1.590266 -1.117187
H  1.091493 0.248694 -2.093578
H  2.001296 -1.645878 1.123109
H  0.808206 -0.509408 1.798891
H  -3.46734 0.207681 0.615756
