program: Gaussian 09
title: 000227791
version: EM64L-G09RevD.01
frameworkgroup: C1[X(C16H10N2O4)]
method: RPBEPBE
basis: SDD
operation: Freq
keyword: #p
keyword: freq=noraman
keyword: PBEPBE/SDD
title: #p freq=noraman PBEPBE/SDD
converged: YES YES NO NO
title: Mulliken charges:
elementType: O O O O N N C C C C C C C C C C C C C C C C H H H H H H H H H H
charge: -0.262428 -0.256155 -0.202464 -0.176514 -0.051395 -0.004239 0.427817 -0.045303 0.194377 -0.462723 0.256236 0.434972 0.170456 -0.079428 -0.376371 -0.406970 -0.338106 -0.204720 -0.384947 -0.315969 -0.246977 -0.214835 0.267233 0.266355 0.287187 0.253788 0.238749 0.243224 0.244456 0.268520 0.237847 0.238328
chargesum: 0.00000
title: Mulliken charges with hydrogens summed into heavy atoms:
elementType: O O O O N N C C C C C C C C C C C C C C C C
charge: -0.262428 -0.256155 -0.202464 -0.176514 -0.051395 -0.004239 0.427817 -0.045303 0.194377 -0.195491 0.256236 0.434972 0.170456 -0.079428 -0.110016 -0.119783 -0.084319 0.277253 -0.140491 -0.047449 -0.009130 0.023493
polarizability: 4.00344164e+02 1.53009610e+01 2.08504166e+02 1.32384892e+01 -1.62566179e+01 1.01813029e+02
1716.lowfreq: -5.2530 -0.0005 -0.0001 0.0008 2.7444 6.3727 33.1236 47.1018 50.9246
frequency: 33.0781 47.0774 50.9178 62.8190 77.8811 93.4756 142.7583 158.2983 196.3151 223.9418 232.8822 263.1953 283.2197 320.2794 342.2935 373.6999 412.0841 418.8497 448.0919 475.6935 524.1839 535.2666 564.6030 579.0375 596.8126 603.2393 616.0743 661.9417 679.5102 689.9504 720.6188 734.8701 745.3779 765.6015 772.8687 788.3203 792.0831 824.4996 834.7378 861.1432 877.1954 891.0146 899.2930 935.2902 944.8821 968.5430 972.5844 984.9912 999.7329 1015.9203 1055.1040 1067.9896 1084.6304 1124.1932 1126.5627 1146.7601 1169.4377 1201.9588 1209.1233 1229.4596 1244.0657 1266.1504 1281.2247 1305.4933 1344.9081 1361.8382 1363.7287 1380.7187 1398.7838 1412.9082 1439.2830 1454.6637 1478.4997 1483.8518 1494.8437 1537.9907 1583.0497 1605.9330 1619.4282 1628.0649 3007.4486 3111.7647 3131.2799 3143.3004 3159.7433 3161.8315 3168.6509 3173.0401 3175.3277 3188.4558
redmass: 4.9239 5.7669 9.2984 4.0620 3.6148 7.5762 6.2715 9.9695 6.8081 6.6565 6.7817 7.0187 6.8898 8.5929 6.5027 4.8297 4.7367 3.4782 5.1943 2.9984 7.9200 3.9795 7.3234 7.2342 6.4603 5.3330 7.3424 7.6252 9.0117 7.6434 4.9865 10.1919 4.6657 1.4938 4.8785 3.8338 4.2210 1.6725 5.1114 6.8680 1.4768 1.4518 5.3535 1.5204 1.3651 6.8259 1.4031 3.9026 1.3413 2.1917 3.2350 1.4951 2.9726 1.6906 1.0585 1.3643 1.1073 2.9371 2.8857 3.0204 2.0794 1.7340 1.9212 3.1634 6.8410 1.4720 5.5957 3.7549 2.7540 5.0987 3.7391 3.6927 1.7317 1.8311 3.8563 6.9462 7.2381 7.9333 6.7912 7.8278 1.0595 1.1121 1.0872 1.0898 1.0928 1.0954 1.0888 1.0934 1.0995 1.0971
irintensity: 2.8991 4.1309 0.8042 0.7311 10.9111 1.3620 1.2923 2.4976 1.0383 4.7071 1.3005 4.1071 0.1223 1.2978 1.6050 0.9378 5.2619 10.7958 5.4045 9.0389 10.2712 1.1833 4.1487 3.6538 1.3331 7.4797 3.0497 5.9954 1.0705 0.1838 2.7814 15.0482 6.0784 48.5014 12.7291 27.0656 23.9537 37.1439 42.9145 3.1380 4.9063 18.9319 1.2271 16.7487 3.1056 132.2888 7.1895 46.5960 0.1541 5.3751 23.5272 7.9422 11.8457 14.0796 1.4196 15.8659 0.6411 182.1476 44.7468 193.0655 41.2942 91.2303 17.4370 125.6169 93.9285 5.9259 75.8467 35.3144 95.3225 32.4919 3.1312 220.5283 24.8894 99.5998 9.6138 62.1688 105.3276 3.5986 47.6485 17.2120 145.1770 29.4702 2.0452 8.4574 0.5351 20.2471 1.4090 1.3746 22.2221 4.9089
temp: 298.150 k
press: 1.00000 atm
elementType: 8 8 8 8 7 7 6 6 6 6 6 6 6 6 6 6 6 6 6 6 6 6 1 1 1 1 1 1 1 1 1 1
symmnumber: 1
zpe: 595492.2 jmol-1
zpe.correction: 0.226811 hartree
zpe.thermalcorrener: 0.243770 hartree
zpe.thermalcorrenthalpy: 0.244714 hartree
zpe.thermalcorrgfe: 0.180643 hartree
zpe.sumelectzpe: -1024.482832 hartree
zpe.sumelectthermal: -1024.465873 hartree
zpe.sumelectthermalent: -1024.464929 hartree
zpe.sumelectthermalfe: -1024.529000 hartree
dipole: -2.7145 -2.5662 -0.7500
dipole: 3.8101
quadrupole: -85.6539 -131.9748 -129.7800
quadrupole: 0.2992 -0.9733 -3.4627
quadrupole: 30.1490 -16.1719 -13.9771 0.2992 -0.9733 -3.4627
hfenergy: -1024.7096429 hartree
pointgroup: C01 [X(C16H10N2O4)]
dipole: 1.0591489 -1.0455522 -0.1789548 debye
polarizability: 400.2967153|-19.056001|177.9477019|-1.0630213|51.4637019|132.4169419 unknown
InChI: InChI=1S/C16H10N2O4/c19-18(20)13-7-10-3-1-2-4-12(10)17-16(13)11-5-6-14-15(8-11)22-9-21-14/h1-8H,9H2
charge 0 multiplicity 1
32 atoms
O  -4.352029 0.18467 1.434757
O  -5.120861 -1.165579 -0.392903
O  0.486743 3.157074 1.655777
O  -0.694363 2.740793 -0.256213
N  1.266505 -0.99653 -0.563733
N  0.20341 2.435934 0.617844
C  -1.020921 -0.281912 -0.2591
C  0.436189 -0.004915 -0.163364
C  -3.274716 -0.138085 0.571127
C  -1.936777 0.209672 0.723237
C  1.003224 1.208801 0.397003
C  3.238774 0.249694 0.283182
C  -3.729899 -0.94217 -0.498496
C  2.634116 -0.88387 -0.390127
C  -1.483607 -1.109435 -1.317464
C  2.368672 1.313263 0.660833
C  -2.851634 -1.449686 -1.459886
C  -5.568979 -0.302585 0.737864
C  4.655092 0.277429 0.492367
C  3.474713 -1.942735 -0.859115
C  5.449596 -0.776085 0.034753
C  4.855388 -1.886834 -0.648793
H  -1.615753 0.810409 1.577942
H  -0.749454 -1.487203 -2.033808
H  2.759679 2.228923 1.115909
H  -3.204514 -2.079181 -2.280017
H  -6.124077 0.56131 0.327752
H  -6.16512 -0.910555 1.435362
H  5.104659 1.133627 1.008554
H  2.999602 -2.787336 -1.366671
H  6.532852 -0.757472 0.193515
H  5.494794 -2.702231 -1.003989
