program: Gaussian 09
title: 000227787
version: EM64L-G09RevD.01
frameworkgroup: C1[X(C10H24NO3P)]
method: RPBEPBE
basis: SDD
operation: Freq
keyword: #p
keyword: freq=noraman
keyword: PBEPBE/SDD
title: #p freq=noraman PBEPBE/SDD
converged: YES YES NO NO
title: Mulliken charges:
elementType: P O O O N C C C C C C C C C C H H H H H H H H H H H H H H H H H H H H H H H H
charge: 1.424171 -0.537239 -0.483051 -0.608403 -0.788593 0.032979 -0.429229 -0.418357 -0.380271 -0.369987 -0.354514 -0.731329 -0.696331 -0.483438 -0.495253 0.180343 0.185834 0.200656 0.232091 0.254265 0.211002 0.189721 0.192707 0.199134 0.197934 0.193362 0.351933 0.211689 0.196586 0.270671 0.211472 0.217778 0.207940 0.247302 0.232490 0.235940 0.229287 0.224534 0.244175
chargesum: 0.00000
title: Mulliken charges with hydrogens summed into heavy atoms:
elementType: P O O O N C C C C C C C C C C
charge: 1.424171 -0.537239 -0.483051 -0.608403 -0.436660 0.213322 -0.042739 0.067999 0.020452 0.021853 0.036782 -0.052382 -0.059141 0.232293 0.202743
polarizability: 1.63138518e+02 2.03231803e+00 1.54307955e+02 4.08229230e+00 -3.17521134e-01 1.28683727e+02
1716.lowfreq: -11.2959 -0.0021 -0.0017 -0.0012 6.2550 7.6188 26.5541 32.0920 35.4892
frequency: 26.0228 31.7690 34.9275 65.4525 68.9203 75.7883 90.1235 92.2802 99.1547 112.1171 124.2611 129.1233 144.2822 160.9899 194.3375 226.5848 235.1829 243.6086 261.5926 276.2284 293.6332 302.9179 334.3887 346.4315 401.6612 415.6702 438.0827 447.6602 483.2973 560.3452 601.8915 657.7311 728.3094 766.3321 773.9991 790.6741 843.0687 894.7318 896.0645 920.2639 971.3792 973.2672 978.8184 1005.7636 1035.4635 1042.9574 1052.8099 1072.4512 1077.6945 1089.6516 1111.4034 1116.9623 1125.7905 1127.7672 1136.3082 1142.2056 1160.9202 1205.8426 1237.3334 1239.7579 1259.9677 1269.1389 1285.9763 1289.6961 1325.0545 1334.7428 1346.9503 1352.3091 1360.5368 1392.9645 1394.0682 1398.5934 1422.9202 1429.8405 1458.4776 1458.8790 1464.8085 1467.3043 1470.8151 1472.6844 1473.2866 1478.8392 1479.0353 1481.3008 1483.2652 1489.9281 1506.4196 2943.7540 2951.9413 2956.5642 2965.9837 2967.2110 2968.4805 2972.3644 2972.6817 2981.6766 2989.0962 2993.6429 3006.2847 3018.5041 3032.6796 3059.5592 3060.5210 3063.7930 3068.2212 3072.6845 3080.9627 3084.1074 3116.8276 3124.7055 3555.4741
redmass: 4.2342 4.0170 3.7963 2.4285 1.9389 2.2881 1.9392 1.4191 3.4758 2.1222 1.6287 2.1505 2.8765 1.8493 3.4913 2.4783 1.4044 1.5810 1.9843 3.2637 3.1090 3.1315 7.3560 2.2387 1.9276 4.7340 2.9034 2.8815 2.5715 2.7516 6.3845 9.6156 1.0866 1.1848 2.3716 2.1232 1.8563 1.8405 2.1552 1.3051 7.4199 1.6750 8.8771 2.7468 1.5694 2.5076 2.7860 3.4582 2.4203 2.1918 1.2462 1.2561 1.3048 1.8557 1.4090 2.1605 2.8099 1.5014 1.2644 1.1452 1.2446 1.2049 1.2011 1.1109 1.3534 1.4186 1.5098 1.5563 1.3307 1.2655 1.2561 1.2079 1.1205 1.1238 1.0505 1.0512 1.0664 1.0737 1.0652 1.0527 1.0599 1.0540 1.0436 1.0593 1.0695 1.0889 1.0506 1.0779 1.0632 1.0595 1.0598 1.0309 1.0601 1.0379 1.0369 1.0303 1.0892 1.0730 1.1008 1.1001 1.1032 1.0979 1.1043 1.0984 1.1006 1.0993 1.1048 1.0995 1.1013 1.1031 1.0754
irintensity: 1.3092 1.0853 0.4487 2.7089 2.1301 3.1208 0.1060 0.5985 3.3827 1.7002 1.0476 1.2539 0.9201 6.5379 17.7241 0.4164 0.0543 0.3214 0.4612 17.8802 1.0047 3.7229 19.1997 7.1056 66.7538 25.8969 7.9982 6.8727 9.9208 15.0041 84.7280 166.4801 3.0534 3.6300 26.6409 68.2918 57.6607 5.2748 9.0800 9.7146 120.1454 68.8631 218.9171 1.5436 0.4267 61.0953 6.9035 70.9114 21.7693 7.5078 0.3528 0.6952 1.0363 9.0013 2.7996 26.0724 8.2701 2.7388 3.1097 32.8982 4.7321 2.5924 1.5835 0.5453 2.8891 4.3775 1.3731 3.1952 0.4261 28.6209 40.0357 30.4701 2.8009 4.4487 8.3493 9.8762 2.4298 2.0130 5.2673 18.2495 3.2819 6.3376 11.2710 14.1111 9.9795 20.2027 11.5131 5.3399 9.5336 5.9434 1.4036 53.2970 123.4989 55.8844 18.7550 59.1274 20.3651 51.9756 1.7079 29.2144 99.3441 15.7811 36.3725 46.6938 88.6019 51.9480 30.1902 22.4960 17.2737 15.6725 25.1109
temp: 298.150 k
press: 1.00000 atm
elementType: 15 8 8 8 7 6 6 6 6 6 6 6 6 6 6 1 1 1 1 1 1 1 1 1 1 1 1 1 1 1 1 1 1 1 1 1 1 1 1
symmnumber: 1
zpe: 882544.8 jmol-1
zpe.correction: 0.336144 hartree
zpe.thermalcorrener: 0.357356 hartree
zpe.thermalcorrenthalpy: 0.358301 hartree
zpe.thermalcorrgfe: 0.284220 hartree
zpe.sumelectzpe: -1015.817959 hartree
zpe.sumelectthermal: -1015.796746 hartree
zpe.sumelectthermalent: -1015.795802 hartree
zpe.sumelectthermalfe: -1015.869883 hartree
dipole: -2.6647 -3.2820 2.0590
dipole: 4.7023
quadrupole: -104.3249 -98.2153 -102.4265
quadrupole: -9.6704 11.4916 1.1757
quadrupole: -2.6693 3.4403 -0.7709 -9.6704 11.4916 1.1757
hfenergy: -1016.1541028 hartree
pointgroup: C01 [X(C10H24N1O3P1)]
dipole: -0.9639885 1.3546829 -0.8112866 debye
polarizability: 163.0777611|-2.4108536|154.5330081|-3.3642626|0.2272965|128.5194306 unknown
InChI: InChI=1S/C10H24NO3P/c1-5-7-8-10(6-2)9-11-15(12,13-3)14-4/h10-11H,5-9H2,1-4H3
charge 0 multiplicity 1
39 atoms
P  2.178683 0.112107 0.336916
O  2.438955 0.517038 -1.338069
O  2.975133 1.422448 1.173271
O  2.727337 -1.265844 0.9008
N  0.483098 0.338814 0.35303
C  -1.413528 -1.346304 0.332893
C  -2.340125 -0.488285 -0.574015
C  -0.433616 -0.48284 1.174924
C  -0.682655 -2.432057 -0.502158
C  -3.187336 0.57728 0.159013
C  -4.202364 1.281849 -0.771369
C  0.073934 -3.487035 0.336265
C  -5.038969 2.358423 -0.047187
C  3.825522 0.485043 -1.85117
C  2.453026 2.793501 1.01632
H  -2.062083 -1.863229 1.075388
H  -1.738462 -0.002148 -1.372737
H  -3.026025 -1.178394 -1.106845
H  -1.002561 0.178304 1.856171
H  0.187018 -1.14221 1.80735
H  0.024585 -1.936092 -1.19768
H  -1.437234 -2.941009 -1.136338
H  -3.734401 0.097719 0.997779
H  -2.532405 1.34647 0.617808
H  -4.87827 0.521404 -1.212991
H  -3.659052 1.742852 -1.621852
H  0.07979 0.896081 -0.402718
H  0.459453 -4.294677 -0.313086
H  -0.594188 -3.951069 1.087708
H  0.94358 -3.048158 0.856925
H  -5.610751 1.917598 0.791196
H  -5.76093 2.839411 -0.732366
H  -4.390423 3.151566 0.371028
H  4.251814 -0.52932 -1.754634
H  4.46525 1.210813 -1.315957
H  3.742835 0.761129 -2.913059
H  1.386321 2.847599 1.305361
H  2.577478 3.156475 -0.021771
H  3.057661 3.405648 1.702755
