program: Gaussian 09
title: 000021481
version: EM64L-G09RevD.01
frameworkgroup: C1[X(C16H8O2)]
method: RPBEPBE
basis: SDD
operation: Freq
keyword: #pfreq=noraman
keyword: PBEPBE/SDD
title: #p freq=noraman PBEPBE/SDD
converged: NO YES YES YES
title: Mulliken charges:
elementType: O O C C C C C C C C C C C C C C C C H H H H H H H H
charge: -0.129705 -0.157824 -0.349790 0.418041 0.254222 0.168561 0.261882 0.432868 -0.566695 -0.405683 -0.387017 -0.427903 -0.168093 -0.400626 0.085409 -0.211086 -0.236143 -0.223175 0.280977 0.254799 0.260487 0.257847 0.279101 0.235790 0.237947 0.235808
chargesum: 0.00000
title: Mulliken charges with hydrogens summed into heavy atoms:
elementType: O O C C C C C C C C C C C C C C C C
charge: -0.129705 -0.157824 -0.349790 0.418041 0.254222 0.168561 0.261882 0.432868 -0.285719 -0.150884 -0.126529 -0.170056 -0.168093 -0.121524 0.085409 0.024704 0.001804 0.012633
polarizability: 2.96891392e+02 -6.51097308e+00 2.19600048e+02 -1.75197847e-03 1.06803382e-02 6.50222718e+01
1716.lowfreq: -0.0003 0.0004 0.0007 6.9075 9.8258 11.5368 58.9456 86.7919 117.0394
frequency: 58.9385 86.7724 117.0382 176.5124 177.8455 193.8545 277.8884 286.3672 338.9154 358.4385 394.3148 408.3770 432.7230 462.5365 467.4196 510.5528 521.6960 576.8641 588.6886 638.7226 641.2972 646.0992 683.4289 744.8376 771.0540 786.0523 793.6473 798.8951 799.3225 860.1412 895.6544 905.2347 918.5086 943.0531 946.0764 962.3749 995.2088 998.1844 1020.1630 1042.6040 1068.5823 1101.2304 1151.1030 1171.2439 1175.7056 1189.1612 1219.2563 1258.8295 1267.0241 1288.8099 1321.1780 1375.1590 1399.6633 1431.3063 1447.6659 1471.0674 1475.1043 1549.2287 1583.2099 1584.9371 1606.5376 1616.3724 1627.1103 1644.7069 3131.5890 3135.9655 3139.3785 3148.4513 3150.8185 3153.1631 3168.5936 3169.9755
redmass: 11.6197 6.4365 4.3945 4.8809 5.7027 4.3301 4.5032 5.8199 14.6783 9.3814 4.5142 10.1073 3.5843 4.4226 7.6252 4.1352 5.9166 8.1110 3.9666 5.9403 6.1511 3.3696 6.7016 1.9136 1.9976 5.0364 2.2843 7.0749 1.9815 2.3566 1.6334 6.0929 1.7772 7.7713 1.5893 1.4473 1.3623 1.3810 2.2149 2.4877 2.6362 2.3432 2.0005 1.4455 1.6020 1.4697 2.0913 4.1968 1.9761 1.8695 2.0542 7.9586 2.9660 2.4685 3.2692 3.1268 4.2032 10.9125 7.0023 8.3028 8.7576 7.4748 9.6670 8.9965 1.0860 1.0875 1.0902 1.0932 1.0947 1.0926 1.1002 1.0979
irintensity: 0.0410 0.5353 2.8343 1.6019 0.9547 6.0941 0.2092 1.8571 3.0328 1.6237 6.7629 0.0154 0.9968 0.1368 0.4105 0.1010 1.5394 0.0531 2.6063 5.1015 0.0506 4.8446 2.0161 37.6929 49.5769 0.2621 0.0800 1.0817 74.6222 1.0337 2.8674 5.8525 20.2816 10.3922 3.5759 2.3811 0.0007 1.7792 1.8278 0.0134 2.7377 10.6588 9.8959 10.7279 27.1892 16.0455 5.9325 67.0700 12.6444 2.2615 12.0678 24.8781 11.4632 21.7595 16.0687 3.4031 28.2142 380.6442 12.8898 32.1420 4.4641 53.4883 6.8991 31.5609 1.8051 4.6901 0.8216 1.6895 11.6377 14.8065 34.5868 12.7736
temp: 298.150 k
press: 1.00000 atm
elementType: 8 8 6 6 6 6 6 6 6 6 6 6 6 6 6 6 6 6 1 1 1 1 1 1 1 1
symmnumber: 1
zpe: 493151.1 jmol-1
zpe.correction: 0.187831 hartree
zpe.thermalcorrener: 0.200268 hartree
zpe.thermalcorrenthalpy: 0.201212 hartree
zpe.thermalcorrgfe: 0.148967 hartree
zpe.sumelectzpe: -763.769601 hartree
zpe.sumelectthermal: -763.757164 hartree
zpe.sumelectthermalent: -763.756220 hartree
zpe.sumelectthermalfe: -763.808465 hartree
dipole: -7.3465 3.0832 -0.0009
dipole: 7.9673
quadrupole: -112.4597 -91.2709 -105.6891
quadrupole: 12.8083 -0.0043 0.0059
quadrupole: -9.3198 11.8690 -2.5492 12.8083 -0.0043 0.0059
hfenergy: -763.9574322 hartree
pointgroup: C01 [X(C16H8O2)]
dipole: 2.8832371 1.2298451 0.0003581 debye
dipolederiv: -0.9622281 -0.0958448 0.0000904 0.1131415 -0.344238 -0.0000103 -0.0000676 0.0000311 -0.2802827 -0.843213 -0.3653184 0.0001212 -0.4307485 -0.7000651 0.0000964 -0.000265 -0.000281 -0.3011076 -0.2059381 0.2893915 -0.000049 0.2003889 0.0785567 0.0000238 0.0000639 -0.0000389 -0.038193 0.8467385 -0.0143978 -0.0000407 -0.0243192 0.3230574 -0.0000548 0.0001715 0.0001481 0.0405659 0.0311853 -0.4250928 0.0000454 -0.0087392 -0.0497157 0.0000169 -0.0000579 0.0000527 0.0100343 -0.4887279 0.1342682 0.0000188 0.2141547 -0.1058535 0.0000029 0.0000807 0.0000012 0.0007846 0.3936199 0.1424788 -0.00003 -0.0875409 -0.0726264 0.0000006 -0.0000703 -0.000015 0.017277 -0.2069646 -0.161525 0.0000505 -0.3492338 -0.2690707 0.0000442 0.0000493 0.0000675 0.0798339 -0.9165934 -0.4085045 -0.0000056 -0.0431126 -0.0766137 -0.0000221 0.0000972 -0.000066 -0.1544952 0.0725303 0.16315 -0.000025 0.0433593 0.047347 -0.0000407 0.0000077 -0.0000346 -0.1418981 0.1241041 -0.0181555 -0.0000185 -0.1480347 0.1617625 -0.0000312 -0.0000171 -0.0000214 -0.1265237 -0.4214453 -0.0647003 0.0000009 0.2277692 0.1308563 -0.0000329 -0.0000006 -0.0000297 -0.1537481 1.1163953 0.244414 -0.0001236 0.1765761 0.5581204 -0.0001518 -0.0000607 -0.0001699 0.1350076 0.058796 -0.0993069 0.000008 0.247547 -0.0914116 -0.0000232 -0.000054 0.0000167 -0.1307437 1.3772079 0.6340347 -0.0000697 0.1765545 0.4247603 0.0000916 0.0000837 0.0003011 0.2113667 -0.24137 -0.0068299 0.0000057 -0.1329073 0.171518 -0.0000545 0.0000252 -0.0000502 -0.1408266 -0.0428772 -0.005128 -0.0000033 -0.1747543 0.02471 -0.0000107 0.0000208 -0.0000197 -0.1598994 0.2061833 0.0499985 -0.0000254 -0.0455536 -0.1329914 -0.0000057 -0.000019 -0.0000003 -0.1312791 0.0277732 0.049212 -0.0000017 0.0713503 -0.0183934 0.0000063 -0.0000495 -0.0000352 0.1595551 -0.0030723 -0.1125942 0.0000214 -0.0709067 0.0190162 0.0000204 0.0000171 0.0000305 0.1533593 0.081465 -0.0760967 0.0000121 -0.0072805 -0.0593668 0.0000276 -0.0000035 0.0000251 0.1534796 0.0842458 -0.0114343 0.0000072 -0.0663476 -0.0780659 0.0000288 0.0000238 0.0000227 0.158381 0.0009329 0.0586487 -0.0000025 0.0093459 0.0906117 0.0000118 0.0000122 0.0000115 0.1592251 0.0713179 0.0450753 -0.0000058 0.0489985 -0.1109053 0.0000421 -0.0000088 0.0000296 0.158359 -0.0412669 0.0937032 -0.0000006 0.1155497 0.0033228 0.0000118 0.0000079 0.0000124 0.1643592 -0.1187987 -0.0394455 0.0000198 -0.0552567 0.0756781 0.0000129 0.000013 0.0000116 0.1574088 unknown
polarizability: 296.8129649|6.960486|219.6784755|-0.0016898|-0.0106904|65.0222718 unknown
InChI: InChI=1S/C16H8O2/c17-14-8-13-10-5-2-1-4-9(10)11-6-3-7-12(15(11)13)16(14)18/h1-8H
charge 0 multiplicity 1
26 atoms
O  -4.051512 -0.105926 -0.000033
O  -3.083694 -2.751746 -0.000612
C  -0.443819 0.414982 -0.00003
C  0.070639 -0.963606 0.000062
C  0.625309 1.349057 -0.000222
C  1.543834 -0.84077 -0.000034
C  1.885428 0.560095 -0.000206
C  -1.797465 0.785804 -0.000056
C  -0.796498 -2.030718 0.000137
C  0.317377 2.725101 -0.000413
C  2.549465 -1.826166 0.000025
C  3.232683 0.959807 -0.000339
C  -2.807981 -0.30874 0.000172
C  -2.104123 2.173561 -0.000293
C  -2.257814 -1.793472 0.000387
C  -1.05145 3.119778 -0.00046
C  3.905666 -1.41605 -0.000101
C  4.241173 -0.039389 -0.000289
H  -0.473068 -3.07712 0.000104
H  1.103018 3.488162 -0.000561
H  2.294864 -2.891524 0.000164
H  3.509808 2.019238 -0.000474
H  -3.151162 2.492561 -0.000328
H  -1.295249 4.187627 -0.000642
H  4.702274 -2.167277 -0.000069
H  5.295799 0.257232 -0.00039
