program: Gaussian 09
title: 000227780
version: EM64L-G09RevD.01
frameworkgroup: C1[X(C21H22N2O3)]
method: RPBEPBE
basis: SDD
operation: Freq
keyword: #p
keyword: freq=noraman
keyword: PBEPBE/SDD
title: #p freq=noraman PBEPBE/SDD
converged: YES YES NO NO
title: Mulliken charges:
elementType: O O O N N C C C C C C C C C C C C C C C C C C C C C H H H H H H H H H H H H H H H H H H H H H H
charge: -0.204592 -0.201705 -0.221809 -0.190654 0.010286 -0.239017 -0.269478 0.011744 -0.447874 -0.449488 0.335537 -0.396771 -0.396763 0.065524 -0.387639 0.177801 -0.331967 0.299416 -0.360075 -0.242932 -0.362068 -0.357425 -0.215896 -0.244665 -0.236547 -0.227659 0.281033 0.279538 0.167098 0.209633 0.205756 0.206860 0.216549 0.204236 0.192311 0.191169 0.204617 0.200617 0.193470 0.311957 0.280085 0.240611 0.283233 0.272788 0.241232 0.236448 0.232506 0.232967
chargesum: 0.00000
title: Mulliken charges with hydrogens summed into heavy atoms:
elementType: O O O N N C C C C C C C C C C C C C C C C C C C C C
charge: -0.204592 -0.201705 -0.221809 -0.190654 0.010286 0.042016 0.010060 0.178842 -0.032485 -0.026078 0.335537 -0.000224 -0.000977 0.065524 0.006448 0.177801 -0.020010 0.299416 -0.079990 -0.002320 -0.078835 -0.084637 0.025336 -0.008218 -0.004041 0.005309
polarizability: 2.72290768e+02 -2.13371736e-01 2.48301957e+02 1.76242941e+01 3.74710395e+00 2.37619703e+02
1716.lowfreq: -18.9453 -10.0988 -0.0007 -0.0003 0.0001 6.8910 14.5370 24.0103 32.0550
frequency: 10.7590 23.6963 31.8065 39.6264 41.8075 51.7882 69.5329 78.3966 109.1417 124.8002 129.7982 149.3964 179.6820 198.1375 210.0827 227.2511 247.3514 290.6424 302.4805 334.8026 364.0776 378.3478 402.5838 407.7452 418.9880 422.5158 431.3999 452.0416 474.4233 499.8083 522.0049 528.9007 572.5148 606.4909 613.3104 648.7032 658.4554 670.7507 687.4840 700.6027 729.6769 744.5510 776.0188 786.6066 790.2805 791.1404 799.1370 821.2371 843.8207 853.4468 864.1826 873.3165 881.6330 900.3936 910.3268 929.7728 940.6007 951.0525 983.2729 984.9924 987.8310 993.9205 1007.6178 1010.3097 1022.2776 1035.0234 1044.3340 1046.9624 1051.5530 1057.3195 1070.5897 1075.5006 1085.0087 1092.2859 1108.9271 1132.3096 1149.8141 1172.0745 1173.7029 1182.3076 1191.2242 1192.8602 1208.7808 1227.3176 1238.3387 1242.0406 1253.3740 1257.0073 1284.7135 1306.6463 1307.6691 1321.7912 1329.1314 1334.0734 1338.8746 1341.1375 1345.2414 1359.6316 1366.2303 1386.1495 1390.1467 1404.5697 1435.8102 1436.9708 1461.2705 1463.3295 1464.9128 1470.9033 1471.8379 1479.0465 1481.1475 1565.5720 1573.1409 1593.6233 1609.0041 1610.8674 2837.4547 2965.9517 2967.4214 2971.6996 2977.6150 2983.4817 3029.1352 3032.8587 3035.8452 3041.3215 3049.6063 3050.7957 3092.4593 3129.0605 3139.8161 3143.2309 3150.2106 3159.1658 3160.5440 3169.1728 3172.0796 3185.9465
redmass: 5.3806 7.3806 3.8840 4.2173 4.1286 4.3937 10.6660 7.1806 5.2300 4.1911 3.7896 5.0251 5.8051 3.9129 3.6702 2.4687 4.3035 6.3309 2.5520 5.3321 3.0067 6.7971 2.8472 4.5482 3.5696 3.6926 3.7798 3.3766 2.8972 2.5062 4.4059 3.6955 3.9699 5.4617 6.3807 5.9672 5.6886 5.7198 4.6418 1.9518 2.9245 3.3818 2.9606 1.4437 1.5212 2.2720 4.6821 4.6006 3.0071 2.9457 1.2569 2.9768 1.7923 1.4697 1.5579 2.1983 2.9653 1.5037 2.0439 1.5795 3.4885 1.6660 1.3360 1.3436 2.2379 2.8937 1.7654 1.6824 1.1279 2.8579 3.6301 1.3900 1.4209 1.4322 2.5977 2.0621 2.3527 1.2003 1.0664 1.9785 1.1681 1.4761 5.8225 3.0682 1.4808 1.4384 1.2828 1.2702 1.6918 1.2906 1.2319 1.3487 1.4859 1.4890 1.5211 1.5122 2.5375 1.6217 2.6098 6.4808 3.0417 2.7207 2.3226 2.2826 1.0860 1.0916 1.0891 1.1000 2.5462 1.0965 2.2126 8.1393 6.4089 6.7658 6.5610 6.2950 1.0807 1.0642 1.0637 1.0616 1.0607 1.0613 1.0975 1.0948 1.1016 1.1029 1.0937 1.0947 1.0876 1.0852 1.0882 1.0871 1.0925 1.0963 1.0915 1.1014 1.0960 1.0973
irintensity: 0.8922 0.4214 1.1968 0.2881 1.4383 1.9712 2.1060 0.7792 3.3349 2.8436 2.8792 0.1897 0.7225 0.5246 0.0468 0.0610 2.8529 0.7391 0.8392 0.3114 0.4200 2.7830 0.5117 2.4190 3.0356 0.1869 2.2119 1.2612 0.0039 0.3995 3.9606 7.4016 7.7716 2.4482 0.2874 19.3723 14.6391 10.4026 15.9687 53.8896 23.5969 6.9210 39.9191 0.3527 52.5799 1.7087 11.5963 4.8899 8.2351 21.9127 0.1042 5.2376 0.4108 7.9226 0.3026 0.3319 9.2370 9.3504 26.6800 0.6611 1.0297 0.8210 0.6980 0.8452 16.4900 8.9680 2.7278 13.9516 0.7474 24.1439 61.3502 11.8279 4.4985 2.5126 0.0643 9.4049 2.7633 20.2241 5.1188 27.6115 26.1244 0.1214 182.0600 214.1635 35.5011 9.0469 1.2171 3.6860 11.4796 5.6609 1.5446 3.9422 9.0702 17.6904 12.6097 12.8918 73.7237 50.1579 30.9499 4.2559 33.1310 41.0488 8.0090 32.1275 3.6228 5.7710 9.2967 15.4404 51.4782 2.7064 1.7666 86.9480 16.3700 20.2663 20.5992 12.8513 49.7820 33.1066 39.7170 35.9416 29.8215 23.0644 74.8601 75.6897 4.3525 6.5730 32.4656 87.9512 5.1305 0.2377 7.5321 5.0057 10.5480 13.9348 7.4534 26.6225 9.2383 7.8885
temp: 298.150 k
press: 1.00000 atm
elementType: 8 8 8 7 7 6 6 6 6 6 6 6 6 6 6 6 6 6 6 6 6 6 6 6 6 6 1 1 1 1 1 1 1 1 1 1 1 1 1 1 1 1 1 1 1 1 1 1
symmnumber: 1
zpe: 1011780.7 jmol-1
zpe.correction: 0.385367 hartree
zpe.thermalcorrener: 0.408255 hartree
zpe.thermalcorrenthalpy: 0.409199 hartree
zpe.thermalcorrgfe: 0.329720 hartree
zpe.sumelectzpe: -1146.611701 hartree
zpe.sumelectthermal: -1146.588813 hartree
zpe.sumelectthermalent: -1146.587869 hartree
zpe.sumelectthermalfe: -1146.667348 hartree
dipole: 0.9855 -0.6035 0.7038
dipole: 1.3531
quadrupole: -136.9986 -147.0606 -157.5001
quadrupole: 6.0086 -7.0895 16.0119
quadrupole: 10.1878 0.1259 -10.3137 6.0086 -7.0895 16.0119
hfenergy: -1146.9970676 hartree
pointgroup: C01 [X(C21H22N2O3)]
dipole: 0.3925068 -0.1342451 0.3336122 debye
polarizability: 273.0461283|5.4787823|249.3270705|15.9519421|-0.8277155|235.8392286 unknown
InChI: InChI=1S/C21H22N2O3/c24-21(15-9-3-1-4-10-15)20-19(22(20)16-11-5-2-6-12-16)17-13-7-8-14-18(17)23(25)26/h1,3-4,7-10,13-14,16,19-20H,2,5-6,11-12H2
charge 0 multiplicity 1
48 atoms
O  -0.311764 -0.555904 2.393387
O  -2.020349 2.604294 -3.294254
O  -1.17695 0.57936 -2.697021
N  1.668842 -0.013365 0.327719
N  -1.428915 1.828158 -2.448519
C  0.654836 0.501018 -0.645023
C  0.450251 -0.847042 0.104614
C  2.937533 -0.537029 -0.270144
C  3.901186 0.640855 -0.529566
C  3.565157 -1.568601 0.690906
C  -0.102046 1.739366 -0.278713
C  5.258305 0.138045 -1.077119
C  4.922806 -2.076536 0.148948
C  -0.547788 -1.000304 1.231645
C  5.894869 -0.902984 -0.125188
C  -1.045978 2.387841 -1.130566
C  0.141955 2.342587 0.983449
C  -1.835933 -1.697845 0.905808
C  -1.690569 3.593133 -0.76046
C  -0.508761 3.530669 1.370333
C  -2.285768 -1.86456 -0.432961
C  -2.639805 -2.171989 1.978077
C  -1.423899 4.165112 0.495327
C  -3.518135 -2.503579 -0.689086
C  -3.863555 -2.818423 1.718115
C  -4.304931 -2.987181 0.382183
H  0.868255 0.36346 -1.712863
H  0.549029 -1.727762 -0.550333
H  2.728423 -1.04384 -1.249527
H  4.056801 1.177775 0.427133
H  3.44119 1.360347 -1.235215
H  2.8677 -2.414448 0.847835
H  3.708186 -1.081849 1.675374
H  5.94295 0.994913 -1.224483
H  5.106276 -0.324741 -2.07456
H  4.758891 -2.641199 -0.792676
H  5.370539 -2.786008 0.870795
H  6.842243 -1.283879 -0.552957
H  6.14972 -0.410038 0.835471
H  0.858362 1.840501 1.640266
H  -2.393269 4.049165 -1.462453
H  -0.302171 3.962387 2.355239
H  -1.701497 -1.464487 -1.26827
H  -2.2824 -2.017486 3.00178
H  -1.928945 5.089765 0.791842
H  -3.867616 -2.616918 -1.720979
H  -4.47529 -3.188765 2.548032
H  -5.258971 -3.486788 0.179157
