program: Gaussian 09
title: 000227778
version: EM64L-G09RevD.01
frameworkgroup: C1[X(C20H17NO2)]
method: RPBEPBE
basis: SDD
operation: Freq
keyword: #p
keyword: freq=noraman
keyword: PBEPBE/SDD
title: #p freq=noraman PBEPBE/SDD
converged: YES YES NO NO
title: Mulliken charges:
elementType: O O N C C C C C C C C C C C C C C C C C C C C H H H H H H H H H H H H H H H H H
charge: -0.415722 -0.228905 -0.029524 0.129685 -0.620483 0.352460 0.328246 0.192337 -0.241766 -0.723670 -0.761254 0.117039 -0.392470 -0.388268 0.271695 -0.114853 -0.256902 -0.246632 0.027121 -0.362770 -0.320798 -0.258905 -0.237187 0.250645 0.239550 0.237760 0.221747 0.217550 0.219925 0.218492 0.223889 0.235496 0.282746 0.225893 0.230502 0.264058 0.265910 0.230783 0.233625 0.382955
chargesum: 0.00000
title: Mulliken charges with hydrogens summed into heavy atoms:
elementType: O O N C C C C C C C C C C C C C C C C C C C C
charge: -0.032767 -0.228905 -0.029524 0.129685 -0.130288 0.352460 0.328246 0.192337 -0.241766 -0.046612 -0.098948 0.117039 -0.156974 -0.105521 0.271695 -0.114853 -0.031009 -0.016131 0.027121 -0.098712 -0.054888 -0.028122 -0.003562
polarizability: 3.71783849e+02 -9.11838719e+00 2.54667874e+02 5.57522722e+00 -1.53979751e+00 1.15625510e+02
1716.lowfreq: -7.4860 -5.6800 0.0002 0.0005 0.0008 3.5764 33.2923 51.1429 60.5841
frequency: 33.2740 51.1381 60.5769 79.3060 102.3214 116.8769 159.8747 167.6864 180.1701 211.7258 244.7771 253.7447 266.7291 278.1523 306.0849 310.2629 325.7333 339.4911 366.1658 369.2749 398.7505 432.1746 472.2340 475.1845 501.7975 524.5590 538.9296 547.9612 561.2233 575.4929 596.3267 626.2291 646.2348 654.9019 693.7439 701.9607 723.7166 747.1109 770.0010 776.6649 782.3819 800.7891 817.7846 840.3145 855.1494 882.3689 890.8360 902.0319 935.3658 943.8420 965.7664 967.4478 969.4133 996.4091 999.9218 1009.6469 1011.1463 1029.2760 1041.5438 1066.8974 1087.3880 1111.6382 1136.4073 1143.2814 1159.0021 1175.0432 1188.1513 1208.1196 1225.7170 1243.8757 1260.2907 1268.3160 1283.0635 1305.7767 1316.1357 1328.0004 1360.5135 1376.7797 1378.6036 1389.9442 1398.6161 1413.5939 1440.8783 1441.8250 1447.2423 1462.2813 1466.9409 1478.1613 1486.0879 1490.0568 1492.3056 1540.9356 1563.5012 1580.2753 1610.3728 1618.1958 1636.9590 2955.0644 2975.9514 2979.1238 3069.8912 3076.1421 3076.7575 3082.8286 3089.2116 3126.5466 3134.1819 3143.4183 3150.2981 3157.0420 3168.3368 3169.3398 3177.3767 3496.4805
redmass: 5.0867 5.7938 6.5265 4.2649 3.7646 3.8835 4.7021 3.4104 5.9243 1.2243 4.4241 1.7175 1.9015 2.5308 3.9789 2.8614 3.4567 4.2528 2.8481 6.5523 4.1942 3.8020 3.6636 3.6292 3.8499 3.8913 3.5034 3.5686 3.2364 5.1780 4.9893 1.7054 4.2235 5.7955 4.0903 5.1378 4.8674 4.5870 1.7784 1.4628 2.5326 3.1766 5.3444 4.7226 3.3489 1.7155 1.4314 3.2166 1.4233 3.0444 1.7335 1.4507 1.4412 1.3321 1.3510 1.6885 2.9527 2.1490 2.3701 3.1169 2.2532 1.7199 1.7284 1.8063 1.6757 1.0779 1.6506 2.1863 2.1034 1.8795 1.8509 2.1080 2.0381 2.2248 3.6543 1.8367 5.1674 7.2818 1.1952 2.5781 1.3388 5.3097 2.5349 1.2995 1.9952 1.0531 1.1189 1.6133 1.6756 1.0848 2.3346 8.3944 8.1139 7.0575 6.3856 6.2463 8.8092 1.0689 1.0348 1.0358 1.0994 1.0996 1.0998 1.0997 1.0900 1.0854 1.0862 1.0900 1.0904 1.0948 1.0960 1.0983 1.0979 1.0638
irintensity: 0.2044 0.2810 1.9602 0.7044 0.1102 2.3857 0.7831 0.0406 1.2551 0.0146 0.0795 0.9728 1.3490 0.2903 0.4445 1.0897 0.5393 0.6833 1.2981 0.2927 1.5398 1.5797 1.9535 7.9833 3.9903 2.6409 15.2600 7.0095 2.2655 20.7841 48.6739 90.3414 15.9345 0.9881 12.9023 4.3019 10.6658 4.8925 53.9599 73.3935 12.9411 6.2371 3.7339 7.1875 0.2748 2.2198 0.7369 19.8968 0.8001 25.5927 7.3159 4.4091 1.6289 0.7012 2.5475 15.1831 30.3233 18.9432 43.9069 114.6903 47.4469 4.4596 25.3507 9.8915 7.2051 3.5706 2.9368 5.2876 14.4608 4.1401 9.6980 13.8815 18.4188 2.1719 40.5115 28.1428 58.6730 6.9183 19.5095 9.8312 12.2226 13.8657 7.5725 2.3844 4.8433 2.7521 6.0956 9.3679 11.9825 18.3173 34.7666 40.3042 22.3879 2.3438 3.6227 1.9354 222.9539 16.7837 25.5170 32.2905 11.1417 30.4189 26.4640 44.7110 17.2811 0.5092 4.1454 16.6819 14.5101 27.2442 12.1245 29.1483 22.9378 32.6498
temp: 298.150 k
press: 1.00000 atm
elementType: 8 8 7 6 6 6 6 6 6 6 6 6 6 6 6 6 6 6 6 6 6 6 6 1 1 1 1 1 1 1 1 1 1 1 1 1 1 1 1 1
symmnumber: 1
zpe: 828050.1 jmol-1
zpe.correction: 0.315388 hartree
zpe.thermalcorrener: 0.334270 hartree
zpe.thermalcorrenthalpy: 0.335214 hartree
zpe.thermalcorrgfe: 0.268886 hartree
zpe.sumelectzpe: -975.968698 hartree
zpe.sumelectthermal: -975.949816 hartree
zpe.sumelectthermalent: -975.948871 hartree
zpe.sumelectthermalfe: -976.015200 hartree
dipole: -1.0808 1.6496 0.8259
dipole: 2.1381
quadrupole: -119.9073 -118.7548 -141.2121
quadrupole: -4.9799 5.7282 3.1281
quadrupole: 6.7174 7.8699 -14.5873 -4.9799 5.7282 3.1281
hfenergy: -976.2840857 hartree
pointgroup: C01 [X(C20H17N1O2)]
dipole: -0.4116348 0.6478674 0.3441262 debye
polarizability: 371.4590559|-11.3750795|255.0285542|3.9777622|2.0770862|115.5896227 unknown
InChI: InChI=1S/C20H17NO2/c1-20(2)11-14-17(19(22)23)13-8-4-6-10-16(13)21-18(14)12-7-3-5-9-15(12)20/h3-10,22H,11H2,1-2H3
charge 0 multiplicity 1
40 atoms
O  1.457043 3.264911 0.613013
O  3.033466 2.70235 -0.981487
N  0.495239 -1.698688 0.036207
C  -2.256406 1.553508 0.297354
C  -0.933501 1.775286 -0.495502
C  -2.754331 0.121751 0.024587
C  0.120808 0.723062 -0.211577
C  -1.801056 -0.9305 -0.139725
C  -0.342109 -0.647217 -0.101587
C  -1.991941 1.713596 1.825572
C  -3.269009 2.635154 -0.154998
C  1.504381 0.965606 -0.149848
C  -4.13154 -0.204029 -0.002621
C  -2.245724 -2.267436 -0.31917
C  2.431121 -0.14179 -0.018038
C  1.857351 -1.470059 0.072668
C  -4.56758 -1.534398 -0.188643
C  -3.619001 -2.572632 -0.345318
C  2.07566 2.347569 -0.255393
C  3.856255 -0.008749 0.043923
C  2.715741 -2.606931 0.217198
C  4.669981 -1.136538 0.188376
C  4.100564 -2.445496 0.274713
H  -0.551257 2.784214 -0.277842
H  -1.172337 1.736242 -1.580398
H  -1.250834 0.979714 2.188594
H  -1.604229 2.726032 2.044141
H  -2.926478 1.563826 2.395622
H  -4.193815 2.610536 0.448515
H  -2.825084 3.639868 -0.028217
H  -3.546849 2.512378 -1.218106
H  -4.877992 0.587031 0.119663
H  -1.486697 -3.047198 -0.430585
H  -5.640012 -1.759081 -0.212299
H  -3.950416 -3.606855 -0.488447
H  4.312427 0.9803 -0.046896
H  2.240176 -3.590007 0.283833
H  5.758058 -1.01669 0.229761
H  4.75452 -3.317093 0.386398
H  1.903207 4.149751 0.502457
