program: Gaussian 09
title: 000227775
version: EM64L-G09RevD.01
frameworkgroup: C1[X(C19H17NO)]
method: RPBEPBE
basis: SDD
operation: Freq
keyword: #p
keyword: freq=noraman
keyword: PBEPBE/SDD
title: #p freq=noraman PBEPBE/SDD
converged: YES YES NO NO
title: Mulliken charges:
elementType: O N C C C C C C C C C C C C C C C C C C C H H H H H H H H H H H H H H H H H
charge: -0.426845 -0.036080 0.110930 -0.362048 0.312698 0.422484 0.185782 -0.747866 -0.729413 -0.228026 -0.390409 -0.493392 -0.397015 0.431472 -0.085342 -0.258468 -0.242056 -0.403428 -0.327253 -0.251434 -0.227440 0.238934 0.210991 0.216048 0.243749 0.242433 0.215622 0.225621 0.241719 0.255397 0.284704 0.344934 0.226957 0.231386 0.238179 0.263679 0.230630 0.232168
chargesum: 0.00000
title: Mulliken charges with hydrogens summed into heavy atoms:
elementType: O N C C C C C C C C C C C C C C C C C C C
charge: -0.081912 -0.036080 0.110930 -0.123115 0.312698 0.422484 0.185782 -0.077079 -0.045737 -0.228026 -0.148690 -0.237995 -0.112312 0.431472 -0.085342 -0.031511 -0.010669 -0.165249 -0.063574 -0.020804 0.004729
polarizability: 3.58855220e+02 9.94387084e+00 2.23299481e+02 -5.26095972e+00 -2.80793558e+00 1.10883469e+02
1716.lowfreq: -5.7280 -0.0006 -0.0004 0.0004 5.5127 11.1204 51.4465 56.5545 90.6006
frequency: 51.4175 56.5114 90.5847 111.9043 150.9777 159.7029 173.5672 206.9387 231.1668 248.3536 257.7047 277.6755 296.2075 316.9293 322.8089 332.1441 343.1592 371.6146 428.2498 443.7369 477.9300 481.1086 495.5359 517.1269 547.5845 555.9618 564.5203 578.7303 603.9560 623.3675 675.2607 724.0832 731.2567 745.6441 764.0469 772.1112 781.1735 803.6542 818.4619 859.0879 875.9606 891.7671 910.3345 914.8542 923.8334 939.6885 958.7014 968.9249 970.7465 995.3909 999.1731 1002.5918 1009.3107 1017.3005 1041.4982 1084.2004 1119.2639 1121.4577 1142.6723 1161.9084 1174.6975 1176.0866 1191.9680 1206.9350 1214.7263 1240.7699 1245.7425 1274.7483 1298.8801 1303.7992 1316.6300 1357.2495 1368.3118 1376.2355 1378.2817 1395.9927 1403.0825 1417.2690 1442.9347 1447.8794 1462.0944 1465.1337 1480.4021 1485.2441 1487.3846 1493.8391 1546.7650 1577.7343 1599.4129 1611.6900 1625.0910 2976.7918 2987.0963 3038.1171 3070.4303 3076.1030 3087.9133 3099.7829 3121.0854 3122.9132 3127.4789 3136.7013 3144.4932 3154.8889 3157.7903 3168.1794 3169.4185 3527.3686
redmass: 4.1311 4.6676 5.1707 3.5731 4.5925 3.4422 3.1558 1.4417 3.5212 1.6011 1.8560 2.2068 3.2868 1.2691 3.8797 3.8799 3.5388 3.5424 4.4707 3.7548 3.1785 3.8987 4.8866 4.1386 4.4699 4.2965 3.6053 6.0569 4.3897 6.3999 5.8001 4.3734 4.8536 4.6006 1.4550 1.7709 2.0893 4.0543 3.5693 3.7547 1.5127 1.4865 3.5053 2.4412 1.7232 1.5365 2.3652 1.4335 1.4027 1.3313 1.7161 1.5890 2.1683 2.2398 2.4149 2.3086 1.7460 1.7230 2.6962 1.4756 1.1048 1.5525 1.6973 1.5114 1.8953 1.9462 1.9950 2.1686 2.3020 2.2239 2.1782 1.3712 3.3530 7.1034 1.1952 1.3180 2.2339 4.1942 2.6095 2.8405 1.0647 1.1045 1.9768 1.0793 1.2997 3.0558 7.2800 6.9245 6.7038 6.4570 6.8268 1.0356 1.0361 1.0866 1.0992 1.0983 1.1000 1.0996 1.0900 1.0895 1.0855 1.0890 1.0900 1.0947 1.0940 1.0992 1.0997 1.0658
irintensity: 0.2889 1.9092 0.3517 0.2303 1.0095 0.0545 3.4523 4.4883 1.0969 2.7526 0.4253 4.9997 13.6462 85.0828 0.6630 0.8394 22.5649 0.3759 0.2265 2.2456 6.3886 9.8959 1.4737 1.0756 7.7193 4.5847 0.4062 11.4651 1.7331 3.1237 0.1807 6.4480 2.3332 0.9117 39.6842 39.1373 68.9465 3.7303 6.7211 15.1032 9.6427 2.2322 23.9612 5.6030 40.4490 4.0689 38.3891 2.0886 5.4390 0.1234 3.2298 4.9215 10.2429 17.6143 12.9079 2.9508 3.3613 6.8487 3.2719 0.5506 1.4027 14.7209 3.3416 34.6238 6.8515 9.8016 3.6758 2.7821 19.2100 3.4436 2.9040 33.1239 9.2199 4.5404 25.0796 10.8223 20.6533 31.3653 4.4607 10.0674 4.5441 3.4588 8.6694 14.7681 8.2201 49.5606 15.3152 1.1676 37.7929 0.4562 9.8804 24.8665 35.1050 23.6737 3.2573 55.1193 29.3360 22.3165 0.7316 12.5676 0.7933 10.8197 14.5362 26.3333 19.1036 33.4433 27.5962 8.5943
temp: 298.150 k
press: 1.00000 atm
elementType: 8 7 6 6 6 6 6 6 6 6 6 6 6 6 6 6 6 6 6 6 6 1 1 1 1 1 1 1 1 1 1 1 1 1 1 1 1 1
symmnumber: 1
zpe: 803143.4 jmol-1
zpe.correction: 0.305901 hartree
zpe.thermalcorrener: 0.322949 hartree
zpe.thermalcorrenthalpy: 0.323893 hartree
zpe.thermalcorrgfe: 0.262467 hartree
zpe.sumelectzpe: -862.759513 hartree
zpe.sumelectthermal: -862.742465 hartree
zpe.sumelectthermalent: -862.741521 hartree
zpe.sumelectthermalfe: -862.802947 hartree
dipole: -0.2148 -0.4794 1.0512
dipole: 1.1752
quadrupole: -102.6500 -116.2403 -130.1450
quadrupole: 4.3838 1.4074 -6.3217
quadrupole: 13.6951 0.1048 -13.7999 4.3838 1.4074 -6.3217
hfenergy: -863.0654141 hartree
pointgroup: C01 [X(C19H17N1O1)]
dipole: 0.0859321 -0.1840968 -0.4153153 debye
polarizability: 359.1707236|-6.4374087|222.8490772|-7.3496103|3.3499508|111.0183696 unknown
InChI: InChI=1S/C19H17NO/c1-19(2)15-9-5-4-8-13(15)17-14(18(19)21)11-12-7-3-6-10-16(12)20-17/h3-11,18,21H,1-2H3
charge 0 multiplicity 1
38 atoms
O  -1.282937 -2.000526 1.850644
N  1.094903 1.240508 -0.076804
C  -2.213564 -1.43217 -0.424372
C  -0.981597 -1.921727 0.398559
C  -2.447933 0.061385 -0.11395
C  0.241442 -1.051995 0.170294
C  -1.32198 0.929392 0.057642
C  -3.429906 -2.326513 -0.083633
C  -1.892033 -1.581262 -1.944715
C  0.058406 0.377576 0.040133
C  -3.745334 0.624927 -0.062655
C  1.535451 -1.56613 0.156401
C  -1.520001 2.321898 0.248259
C  2.659298 -0.688948 0.022057
C  2.383189 0.731589 -0.086192
C  -3.936326 2.010582 0.136808
C  -2.818124 2.864621 0.286576
C  4.016329 -1.142081 -0.001815
C  3.477626 1.646338 -0.212229
C  5.065512 -0.226932 -0.126105
C  4.793143 1.17523 -0.231545
H  -0.764814 -2.972341 0.134612
H  -4.300552 -2.08305 -0.718435
H  -3.174565 -3.386443 -0.266972
H  -3.718027 -2.232117 0.97654
H  -1.017102 -0.97891 -2.245215
H  -1.685709 -2.639951 -2.192825
H  -2.756161 -1.24907 -2.546918
H  -4.620901 -0.021005 -0.178898
H  1.698075 -2.645868 0.262566
H  -0.632359 2.951368 0.362285
H  -1.450375 -1.079722 2.18388
H  -4.951936 2.420511 0.17539
H  -2.961221 3.940245 0.43665
H  4.222088 -2.216096 0.082039
H  3.243206 2.712218 -0.293092
H  6.102919 -0.57835 -0.142617
H  5.626269 1.880118 -0.328249
