program: Gaussian 09
title: 000227773
version: EM64L-G09RevD.01
frameworkgroup: C1[X(C15H13NO)]
method: RPBEPBE
basis: SDD
operation: Freq
keyword: #p
keyword: freq=noraman
keyword: PBEPBE/SDD
title: #p freq=noraman PBEPBE/SDD
converged: YES YES NO NO
title: Mulliken charges:
elementType: O N C C C C C C C C C C C C C C C H H H H H H H H H H H H H
charge: -0.264179 -0.681876 0.508657 0.288521 -0.367230 -0.382198 -0.287468 0.492457 0.097317 -0.421411 -0.428416 -0.321771 -0.343964 -0.354952 -0.250525 -0.234462 -0.231688 0.225254 0.236589 0.270529 0.219438 0.221295 0.203609 0.217362 0.280190 0.225472 0.229111 0.229124 0.312856 0.312361
chargesum: 0.00000
title: Mulliken charges with hydrogens summed into heavy atoms:
elementType: O N C C C C C C C C C C C C C C C
charge: -0.264179 -0.056659 0.508657 0.288521 -0.141976 -0.145610 -0.016939 0.492457 0.097317 -0.201973 -0.207121 -0.118162 -0.126602 -0.074762 -0.025053 -0.005351 -0.002564
polarizability: 4.20472630e+02 1.06777895e+01 1.76120896e+02 1.50933073e+00 4.36474352e-01 6.71561095e+01
1716.lowfreq: -4.5338 0.0002 0.0006 0.0010 3.9839 8.3141 15.2653 32.5359 50.9956
frequency: 14.0545 32.4892 50.9878 71.0870 113.7582 167.9131 185.5757 204.3185 209.2436 293.6327 363.6692 369.5282 400.8489 403.6064 414.0216 415.7012 418.3164 444.1138 495.8921 517.0358 530.7860 614.3608 637.7755 652.6304 675.8168 695.7904 739.0935 763.6237 792.2644 815.4926 823.5180 832.2825 853.1265 876.2965 881.4310 939.2911 950.9508 960.8923 987.2224 989.2940 996.4071 1009.8276 1013.4077 1015.9884 1020.0458 1038.8621 1085.0139 1132.3340 1170.8580 1183.6580 1192.0802 1217.7878 1227.4828 1294.2297 1310.3491 1329.8237 1331.1928 1348.0951 1384.7515 1388.0103 1431.5211 1452.9972 1478.7118 1508.9663 1522.2467 1564.1687 1587.2380 1607.9352 1622.0401 1635.9334 1648.3053 3091.2103 3118.9401 3120.4075 3124.2431 3134.5911 3141.4914 3143.9851 3149.1293 3152.2822 3159.3188 3168.0245 3559.6336 3699.5479
redmass: 3.6436 4.3427 5.2036 6.2760 3.8702 4.7946 4.7274 6.5711 3.0610 5.6589 3.0343 3.3106 2.7345 1.0728 1.3285 2.4788 5.1700 3.6021 6.1047 2.3133 5.1944 6.4227 6.7333 6.8797 3.5933 1.5863 2.9895 5.5252 2.0554 1.2799 5.6964 1.8225 1.2945 1.8520 4.4899 1.4556 1.3839 1.3612 1.4045 5.6273 2.7815 1.3184 1.2680 2.6006 1.6676 2.1354 1.6406 1.2697 1.0670 1.1504 1.1123 2.5166 1.4918 1.4713 1.7452 2.1381 1.3299 2.4788 8.7842 3.9434 2.3444 4.1733 2.2707 8.0845 3.1572 6.2494 6.1381 5.9485 5.7070 2.1255 1.8214 1.0889 1.0872 1.0873 1.0848 1.0885 1.0958 1.0927 1.0957 1.0925 1.0938 1.1000 1.0451 1.1040
irintensity: 0.3651 1.6404 1.0125 0.0063 0.9844 0.4893 1.2999 0.4485 3.1933 11.9723 9.2838 1.9963 0.4981 35.9257 221.4603 50.6357 8.6982 4.9825 17.1419 16.2995 26.2620 0.7611 0.2767 20.5915 6.3473 57.6229 10.5074 1.6396 61.9129 0.6329 6.2981 76.7315 1.3748 5.0853 6.7958 0.5678 4.6393 0.2705 1.7227 1.3839 1.1422 4.9806 33.3006 63.9984 18.1118 47.1219 10.6830 17.1179 14.7099 187.0099 50.2785 209.4556 26.6057 14.5829 86.9066 106.4481 85.1162 19.3281 3.2088 65.3156 0.2345 38.9108 4.2639 598.5527 105.8265 19.8652 90.7253 97.8496 740.9614 25.9555 227.3447 1.3160 2.6136 30.3095 1.0388 10.5782 24.1186 20.6630 3.6363 21.4665 39.8204 28.8941 185.9169 23.9642
temp: 298.150 k
press: 1.00000 atm
elementType: 8 7 6 6 6 6 6 6 6 6 6 6 6 6 6 6 6 1 1 1 1 1 1 1 1 1 1 1 1 1
symmnumber: 1
zpe: 622720.9 jmol-1
zpe.correction: 0.237182 hartree
zpe.thermalcorrener: 0.251943 hartree
zpe.thermalcorrenthalpy: 0.252887 hartree
zpe.thermalcorrgfe: 0.193119 hartree
zpe.sumelectzpe: -708.192282 hartree
zpe.sumelectthermal: -708.177521 hartree
zpe.sumelectthermalent: -708.176577 hartree
zpe.sumelectthermalfe: -708.236345 hartree
dipole: -5.5197 -4.1896 0.0907
dipole: 6.9302
quadrupole: -49.5003 -93.0539 -107.8875
quadrupole: -1.3754 0.3402 0.1224
quadrupole: 33.9803 -9.5734 -24.4069 -1.3754 0.3402 0.1224
hfenergy: -708.4294642 hartree
pointgroup: C01 [X(C15H13N1O1)]
dipole: 2.1655415 1.6532063 -0.1072783 debye
polarizability: 420.3823436|11.3588567|175.3638028|-3.180632|-9.5441188|68.0034888 unknown
InChI: InChI=1S/C15H13NO/c16-14-9-6-12(7-10-14)8-11-15(17)13-4-2-1-3-5-13/h1-11H,16H2
charge 0 multiplicity 1
30 atoms
O  -1.663751 -2.213624 0.209073
N  6.257792 0.990161 -0.006473
C  2.220272 -0.388242 0.065784
C  -2.905188 -0.152556 0.064659
C  2.530585 1.006173 0.012662
C  3.31963 -1.29938 0.093516
C  0.862254 -0.916063 0.09351
C  4.943832 0.536633 0.017104
C  -1.615095 -0.937581 0.118123
C  3.853711 1.462679 -0.011238
C  4.650467 -0.859028 0.07011
C  -0.323749 -0.218687 0.071401
C  -2.971317 1.250576 -0.154912
C  -4.118708 -0.873864 0.234722
C  -4.21833 1.911831 -0.201616
C  -5.362638 -0.215102 0.192437
C  -5.417323 1.183143 -0.025975
H  1.718638 1.741447 -0.009407
H  3.111589 -2.37557 0.134593
H  0.760134 -2.011207 0.13925
H  4.062599 2.538845 -0.051814
H  5.471265 -1.585954 0.092652
H  -0.329107 0.874918 0.031157
H  -2.059054 1.837136 -0.302158
H  -4.047021 -1.954613 0.396006
H  -4.255479 2.993008 -0.376208
H  -6.288689 -0.784864 0.328018
H  -6.383878 1.698597 -0.060863
H  7.035812 0.336764 0.014408
H  6.46685 1.983923 -0.043621
