program: Gaussian 09
title: 000227767
version: EM64L-G09RevD.01
frameworkgroup: C1[X(C9H6N2O2S)]
method: RPBEPBE
basis: SDD
operation: Freq
keyword: #p
keyword: freq=noraman
keyword: PBEPBE/SDD
title: #p freq=noraman PBEPBE/SDD
converged: YES YES NO NO
title: Mulliken charges:
elementType: S O O N N C C C C C C C C C H H H H H H
charge: 0.219699 -0.400638 -0.240957 0.035825 -0.152449 0.455461 -0.452821 -0.349509 -0.317194 0.135460 -0.230015 -0.234932 -0.225913 0.149903 0.250149 0.261536 0.235380 0.237344 0.236732 0.386938
chargesum: 0.00000
title: Mulliken charges with hydrogens summed into heavy atoms:
elementType: S O O N N C C C C C C C C C
charge: 0.219699 -0.013700 -0.240957 0.035825 -0.152449 0.455461 -0.452821 -0.099360 -0.055658 0.135460 0.005365 0.002412 0.010819 0.149903
polarizability: 2.04475499e+02 -6.19789673e+00 1.47504717e+02 3.69144605e+00 1.05147478e+01 6.78079072e+01
1716.lowfreq: -3.2449 -0.0017 -0.0010 -0.0006 2.6313 8.4763 28.4848 52.2947 86.7417
frequency: 28.4633 52.2531 86.7388 102.0240 165.0054 194.2667 265.4407 274.5834 317.6201 334.3565 375.1870 402.9635 472.1172 507.7661 547.8680 575.0045 595.7643 614.1101 642.9193 656.8934 693.7888 709.6399 742.3423 770.4202 845.5523 878.4982 926.4043 934.5303 976.7967 988.6331 1000.3089 1031.2534 1047.5245 1093.5117 1171.2708 1177.3709 1201.1718 1224.1157 1320.8525 1331.3160 1376.7158 1415.9703 1438.7000 1484.5612 1498.8035 1578.2872 1604.9994 1635.1321 3132.4132 3140.4412 3153.8628 3168.4888 3193.7119 3517.9393
redmass: 11.3772 4.6808 6.6805 8.0833 6.6910 8.0480 8.3627 7.3071 11.3902 7.3876 9.4221 2.8455 5.1206 10.2643 3.0644 2.1299 5.5304 5.7101 3.1980 6.0878 1.7863 10.0545 7.5345 2.0102 1.2474 8.3136 3.1505 2.0222 1.3896 6.1176 1.3360 2.1878 2.9541 1.6524 6.3969 1.0583 1.1201 2.5295 1.9149 2.0585 6.8141 4.3548 2.6497 2.7109 10.9612 5.6990 5.9999 8.8702 1.0858 1.0893 1.0941 1.0996 1.0958 1.0642
irintensity: 1.0749 0.6368 0.4806 0.7862 1.1931 1.1861 8.2013 0.4753 32.3304 0.1056 6.0317 0.6505 2.7089 6.2504 30.1198 60.3643 50.4949 7.2306 58.5672 31.4765 45.5224 28.8950 30.4052 55.0238 6.8043 81.5859 21.3752 4.2764 3.1036 3.9399 0.4328 2.6742 295.6873 39.7107 0.5744 0.0955 3.6383 17.8464 9.0818 27.9176 0.7047 164.2070 65.9693 46.8301 176.1321 1.5880 9.7154 199.5109 0.7091 3.7649 19.2587 24.6964 3.7234 57.3121
temp: 298.150 k
press: 1.00000 atm
elementType: 16 8 8 7 7 6 6 6 6 6 6 6 6 6 1 1 1 1 1 1
symmnumber: 1
zpe: 350605.6 jmol-1
zpe.correction: 0.133539 hartree
zpe.thermalcorrener: 0.145474 hartree
zpe.thermalcorrenthalpy: 0.146418 hartree
zpe.thermalcorrgfe: 0.093828 hartree
zpe.sumelectzpe: -1003.559957 hartree
zpe.sumelectthermal: -1003.548022 hartree
zpe.sumelectthermalent: -1003.547078 hartree
zpe.sumelectthermalfe: -1003.599668 hartree
dipole: -3.2398 1.0765 -0.1315
dipole: 3.4165
quadrupole: -84.2885 -84.2609 -85.7071
quadrupole: 8.1468 -0.1892 4.3263
quadrupole: 0.4637 0.4913 -0.9549 8.1468 -0.1892 4.3263
hfenergy: -1003.6934961 hartree
pointgroup: C01 [X(C9H6N2O2S1)]
dipole: -1.2826322 -0.3902279 -0.0968069 debye
dipolederiv: -0.5328158 0.0668295 0.0508378 0.0860803 -0.2870604 -0.1429363 0.0155486 -0.1761037 0.0273559 -1.1815874 0.5384523 0.1620831 0.5632899 -0.5427086 -0.0245693 0.1092236 -0.0010032 -0.4049758 -0.7460481 -0.1511416 -0.0476161 -0.0376019 -0.8561373 -0.1924797 -0.0793477 -0.1509114 -0.3463403 -0.098391 0.3390242 0.1205945 1.0935039 -0.2361225 -0.111731 0.4526908 -0.0907777 -0.0598287 0.3964565 -0.3220275 -0.1323464 -1.0796681 0.0199007 0.1164031 -0.4925957 0.0780926 -0.1016536 -0.4282807 -0.0493983 -0.0291778 -0.0926795 -0.0280139 -0.0112857 -0.0421744 -0.021375 0.0152093 1.1029478 -0.0323719 -0.0238194 0.1447247 0.4940319 0.173825 0.011012 0.2155844 -0.0146868 0.1737115 0.0708869 0.0962611 -0.1819561 -0.1216729 0.0793935 -0.0929051 0.025899 -0.0032102 0.0732088 -0.0588324 -0.1269296 0.1761646 -0.0061677 0.0674427 0.0969446 0.0364115 -0.0023684 -0.4821793 0.0001114 -0.0089875 0.1343025 -0.5995744 -0.2125736 0.1677703 -0.2184725 -0.0491788 -0.1388519 -0.0734132 -0.1562013 -0.0980767 -0.1297064 0.0401624 -0.2241313 0.0446502 0.0034103 -0.1837742 0.0752455 0.1353308 0.0544995 -0.0709448 0.1177617 0.1425162 0.0991039 0.0361998 0.1268886 0.0471441 -0.004297 0.0575204 -0.0884838 0.0597032 0.0216143 0.072549 -0.0012637 1.5121213 -0.1858381 -0.0258597 -0.6095058 1.6796014 0.4250457 -0.0916929 0.4212119 0.3992484 0.0696479 -0.051628 -0.0673872 -0.0162758 0.0949696 -0.0870413 -0.0704127 -0.0497472 0.0195337 0.0569903 0.0132919 0.0840262 -0.0155353 0.1091847 -0.0513044 0.0746561 -0.0225399 0.0462955 -0.0043729 0.0131767 0.0859371 0.0341892 0.1327362 -0.0629892 0.1027645 -0.0634041 -0.008534 0.043479 -0.0375004 -0.0456856 -0.0641087 0.1018669 -0.0945148 -0.0644446 -0.0930739 -0.0239128 -0.1145104 -0.0486031 -0.0077914 -0.0487553 0.1352781 -0.0268302 -0.0099334 -0.0240091 0.1059042 0.3553599 -0.1534079 -0.0589718 -0.1001119 0.1990232 -0.0614819 -0.0271032 -0.0820846 0.3627961 unknown
polarizability: 204.4772341|7.6067836|123.7713031|-3.9496688|37.6449737|91.5395858 unknown
InChI: InChI=1S/C9H6N2O2S/c12-9(13)7-8(14-11-10-7)6-4-2-1-3-5-6/h1-5,12H
charge 0 multiplicity 1
20 atoms
S  0.921407 2.301773 0.887637
O  2.998972 -1.965385 -0.583807
O  0.705016 -2.233078 -0.809531
N  2.846331 0.584614 0.125886
N  2.89967 1.753322 0.582671
C  -0.937804 0.332813 0.189185
C  0.493847 0.692283 0.277221
C  -1.822008 0.710223 1.242507
C  -1.47217 -0.326643 -0.952591
C  1.633358 -0.085474 -0.081843
C  -3.197573 0.419267 1.163619
C  -2.853394 -0.597115 -1.034436
C  -3.719915 -0.233251 0.021778
C  1.680854 -1.49687 -0.524317
H  -1.419307 1.212889 2.129072
H  -0.813503 -0.618323 -1.772792
H  -3.860601 0.702237 1.987903
H  -3.250857 -1.097462 -1.923576
H  -4.790889 -0.454012 -0.043881
H  2.975464 -2.914907 -0.882909
