program: Gaussian 09
title: 000227756
version: EM64L-G09RevD.01
frameworkgroup: C1[X(C6H10O5)]
method: RPBEPBE
basis: SDD
operation: Freq
keyword: #pfreq=noraman
keyword: PBEPBE/SDD
title: #p freq=noraman PBEPBE/SDD
converged: YES YES NO NO
title: Mulliken charges:
elementType: O O O O O C C C C C C H H H H H H H H H H
charge: -0.233338 -0.423345 -0.454138 -0.430810 -0.198131 -0.153221 0.105642 -0.150502 0.181695 -0.712577 -0.339930 0.282783 0.280466 0.245857 0.230764 0.234360 0.244017 0.225226 0.346491 0.361722 0.356969
chargesum: 0.00000
title: Mulliken charges with hydrogens summed into heavy atoms:
elementType: O O O O O C C C C C C
charge: -0.233338 -0.076853 -0.092417 -0.073840 -0.198131 0.129561 0.105642 0.129965 0.181695 -0.001597 0.129313
polarizability: 8.84235172e+01 6.25391948e+00 7.77898066e+01 5.86545640e-01 2.11411534e+00 6.90787665e+01
1716.lowfreq: -13.3834 -0.0001 0.0006 0.0009 8.6230 19.7707 64.4376 83.0559 122.1936
frequency: 64.3263 83.0024 122.1684 155.1872 174.4553 209.2696 236.8989 280.3486 303.0199 313.2996 338.3948 346.7911 379.7851 420.8491 454.9290 505.0081 563.7383 597.8411 668.1857 676.2140 729.5319 843.2273 867.9050 884.2636 965.4674 974.3220 1012.1353 1025.3511 1027.6127 1069.9191 1080.7181 1133.9931 1169.9634 1182.1176 1205.0278 1260.3829 1283.3731 1303.2886 1329.5750 1343.5175 1370.1885 1381.0661 1397.5647 1457.1761 1463.6858 1467.1171 1694.7177 2996.9018 2998.9593 3067.8493 3085.4826 3093.7174 3102.1610 3108.6100 3536.5130 3548.7505 3549.5851
redmass: 5.5591 6.7276 2.9814 5.3724 1.2244 2.9138 4.2700 3.5096 3.9696 1.6183 2.4475 1.2827 2.1684 1.2248 4.7806 5.1126 3.3125 4.8975 5.4909 5.0387 6.0654 4.2392 2.8745 2.6110 3.1210 3.3927 2.3763 3.9729 2.5878 2.2320 1.7174 2.3768 2.4446 1.3307 1.2843 1.6728 1.5010 1.3316 2.0776 1.1839 1.2000 1.2499 1.2168 1.0567 1.0571 1.0841 12.4255 1.0366 1.0629 1.0888 1.1001 1.0986 1.0881 1.0994 1.0664 1.0663 1.0659
irintensity: 5.2327 3.2749 4.3872 3.2671 2.5058 4.4874 4.1680 6.2190 7.2580 23.5610 34.1736 128.1075 122.9122 140.8221 21.8995 7.2224 8.4345 10.6064 0.4090 2.4975 9.0234 45.2566 29.6827 61.5097 107.0884 111.5823 81.2822 75.3998 64.4302 37.1024 23.0112 7.9407 28.9239 15.1821 39.1887 6.5203 22.1086 24.4095 13.9294 24.9560 22.0598 14.3936 22.9163 16.7399 12.1109 6.5040 264.5563 8.9635 19.3021 4.0382 22.4328 12.4635 3.2086 13.2371 11.8966 13.9114 11.9387
temp: 298.150 k
press: 1.00000 atm
elementType: 8 8 8 8 8 6 6 6 6 6 6 1 1 1 1 1 1 1 1 1 1
symmnumber: 1
zpe: 424108.8 jmol-1
zpe.correction: 0.161535 hartree
zpe.thermalcorrener: 0.173315 hartree
zpe.thermalcorrenthalpy: 0.174259 hartree
zpe.thermalcorrgfe: 0.124444 hartree
zpe.sumelectzpe: -609.854608 hartree
zpe.sumelectthermal: -609.842827 hartree
zpe.sumelectthermalent: -609.841883 hartree
zpe.sumelectthermalfe: -609.891698 hartree
dipole: -2.1425 1.0761 0.8487
dipole: 2.5433
quadrupole: -71.1986 -72.9308 -62.4237
quadrupole: -0.0746 -2.5824 -5.5563
quadrupole: -2.3475 -4.0798 6.4273 -0.0746 -2.5824 -5.5563
hfenergy: -610.0161423 hartree
pointgroup: C01 [X(C6H10O5)]
dipole: -0.8254712 0.4789195 0.3008022 debye
dipolederiv: -1.2191487 -0.489943 0.0471858 -0.2582579 -0.6280595 -0.1146902 0.2332422 0.0470129 -0.3762355 -0.6255032 0.0417766 -0.0242283 0.0267614 -0.4145805 0.3017436 -0.0587632 0.3626111 -0.4634213 -0.4780442 0.1978108 0.0398966 0.2670714 -0.3885854 0.064176 0.0079015 0.0757765 -0.7176029 -0.6728978 0.2848839 0.0247914 0.3733641 -0.4146898 0.0785158 0.0643017 0.0574984 -0.5431138 -0.6918875 -0.2461373 0.008402 -0.3923909 -0.9119505 -0.1738296 -0.0067578 -0.1687919 -0.3680031 0.2575057 -0.0735321 0.1188431 -0.1140077 0.330808 -0.1920239 0.0094422 -0.2783862 0.4105676 0.2959471 -0.1151476 0.0632206 -0.0714725 0.1052927 -0.1353506 0.0775537 -0.1532196 0.4277787 0.1943821 0.2250454 0.021286 0.355708 0.4116458 0.0926221 0.1002572 0.1043342 0.2164033 1.4001802 0.669914 -0.1725673 0.4675988 1.0452474 0.2760309 -0.4050821 0.1981118 0.324314 -0.1594199 0.0484895 -0.0647747 0.0178851 0.0101658 0.0137325 0.0172087 0.0147116 -0.0387125 0.5132515 -0.157056 -0.0927181 -0.2389779 0.3099406 0.0582539 -0.0672874 -0.007033 0.2753298 0.0844492 0.0001705 -0.0360742 -0.0088215 0.0104316 -0.0449193 -0.0289977 -0.0411492 -0.0183591 0.034313 -0.0444561 0.0271338 -0.0588318 0.010012 0.0195984 0.0291745 0.0568134 -0.0388228 0.0496577 0.0320235 0.0168571 0.0600219 0.0144868 -0.0943562 0.0491404 -0.0965081 0.0243256 0.0963782 0.0133113 -0.0102774 0.0293771 0.0998402 0.0554764 -0.0505516 0.0563766 -0.0852603 0.0274552 -0.0450304 0.0169116 -0.1081455 -0.0436487 0.0540547 0.0252488 0.0386216 0.0965135 0.006228 0.0042226 0.0885294 -0.0080706 0.0189682 0.0773552 0.0726936 0.0391577 -0.0365882 0.0162391 -0.0571886 -0.0224871 -0.0195664 -0.0810947 -0.076277 -0.0161399 -0.0597325 0.0781269 0.3457836 0.010436 -0.0207724 0.023012 0.1663189 -0.1908017 -0.0132059 -0.1519881 0.1878824 0.2265773 -0.1595984 0.0059329 -0.1742463 0.1790729 0.0218549 -0.0485352 -0.0028388 0.3281419 0.2985533 -0.1399945 -0.035091 -0.1680107 0.1703784 -0.0911657 0.0091563 -0.0913784 0.316736 unknown
polarizability: 88.9396868|5.7932299|77.4930382|0.4336344|1.6044145|68.8593652 unknown
InChI: InChI=1S/C6H10O5/c1-6(10)4(8)3(2-7)11-5(6)9/h3-4,7-8,10H,2H2,1H3
charge 0 multiplicity 1
21 atoms
O  0.658325 -0.823333 -0.921665
O  -0.683476 2.129885 -1.015862
O  -0.810214 -0.216249 1.825022
O  3.307096 -0.474716 0.183971
O  -1.220061 -2.175714 -0.669254
C  -0.172939 1.250493 0.034774
C  -1.143622 0.095468 0.411888
C  1.124624 0.519678 -0.395245
C  -0.63763 -1.104812 -0.438084
C  -2.633129 0.368262 0.228847
C  2.15546 0.258633 0.710439
H  -0.019246 1.910289 0.901244
H  1.609936 1.016077 -1.25235
H  -2.958719 1.149451 0.936135
H  -2.859224 0.720316 -0.791482
H  -3.212225 -0.556531 0.405143
H  1.67602 -0.270224 1.557309
H  2.560747 1.220428 1.068939
H  -0.73234 1.638678 -1.876852
H  -1.371591 -0.978257 2.123874
H  2.979206 -1.326323 -0.20529
