program: Gaussian 09
title: 000227748
version: EM64L-G09RevD.01
frameworkgroup: C1[X(C11H11N5O)]
method: RPBEPBE
basis: SDD
operation: Freq
keyword: #p
keyword: freq=noraman
keyword: PBEPBE/SDD
title: #p freq=noraman PBEPBE/SDD
converged: YES YES NO NO
title: Mulliken charges:
elementType: O N N N N N C C C C C C C C C C C H H H H H H H H H H H
charge: -0.232679 -0.409593 -0.143167 -0.108281 -0.078228 -0.578894 0.446536 0.325395 -0.338689 -0.453534 -0.348249 -0.344205 0.112296 0.098622 -0.789630 0.094382 -0.309453 0.305544 0.229959 0.239317 0.279469 0.339507 0.236737 0.236553 0.260459 0.251257 0.334365 0.344203
chargesum: 0.00000
title: Mulliken charges with hydrogens summed into heavy atoms:
elementType: O N N N N N C C C C C C C C C C C
charge: -0.232679 -0.070086 -0.143167 -0.108281 -0.078228 0.099673 0.446536 0.325395 -0.033146 -0.223574 -0.108932 -0.064736 0.112296 0.098622 -0.055881 0.094382 -0.058196
polarizability: 3.09263045e+02 2.78682628e+00 1.70456069e+02 1.25999727e-01 4.36191006e-02 6.72613947e+01
1716.lowfreq: -4.2000 -0.0007 0.0003 0.0008 5.5008 9.2821 38.5837 43.6169 78.1667
frequency: 38.4108 43.5575 78.1576 78.4433 109.6001 155.9336 174.5699 184.5906 205.2008 247.5164 282.4855 302.4935 397.2191 410.4274 413.7011 446.7103 475.9563 500.2703 518.4439 561.7176 566.8505 572.2240 594.7300 622.3949 663.6375 685.7818 712.5172 733.4370 748.7764 783.4181 803.7911 848.2677 860.9204 862.2855 915.0895 943.6966 948.3245 964.8310 987.3350 998.4889 1004.7357 1026.6308 1072.0279 1074.5646 1126.0626 1186.1876 1188.9186 1247.9452 1267.7152 1278.9669 1308.9281 1324.5732 1368.2834 1374.9330 1405.3062 1428.2883 1448.8192 1463.2462 1466.8774 1494.0371 1499.4473 1520.1705 1546.6578 1579.1026 1595.0439 1621.0535 1627.0819 2984.6961 3069.0018 3117.3952 3125.4685 3145.8001 3160.2700 3164.9356 3193.5477 3509.9967 3551.7462 3710.4650
redmass: 5.1302 5.4162 4.1701 5.0525 7.0681 1.0308 5.5163 7.9974 6.7854 7.4160 4.1003 5.0228 3.8000 3.2848 2.9551 2.7663 5.3059 3.0470 1.2612 1.0478 7.8268 5.0169 2.3315 6.8411 6.8163 2.2491 5.3557 2.3586 3.0383 6.5495 8.0280 1.3395 1.4916 5.9147 10.7313 2.3766 2.4345 1.4492 1.3390 1.3382 3.0729 1.8100 2.5592 2.5335 1.3692 1.2297 3.9226 3.7002 2.3975 3.5675 1.6905 2.0600 1.3418 2.1020 2.5277 4.5171 1.1066 1.0498 4.5244 2.3450 3.0276 5.1023 3.1480 3.4276 5.2479 2.0633 5.6508 1.0374 1.0969 1.0900 1.0991 1.0899 1.0947 1.0934 1.0944 1.0751 1.0445 1.1058
irintensity: 1.2094 0.4863 4.0604 1.5759 0.1200 0.5432 8.3123 4.3032 2.1709 2.7765 0.4483 0.0417 9.8626 1.7519 0.0651 28.1240 11.5451 15.9137 235.4188 28.1807 9.9681 5.9386 17.3066 1.5288 10.5382 29.6624 4.3243 13.0773 4.8063 4.1200 37.2891 31.8291 83.0560 0.9298 26.9847 37.1713 16.7788 9.0979 0.0126 2.5913 1.2015 1.5756 2.9549 0.0869 11.5981 71.1167 30.5004 56.7453 38.2862 369.2197 21.2518 57.0305 56.2537 27.6554 210.5605 38.3675 64.5808 20.3662 37.4360 544.3685 167.2013 1325.9864 209.8527 11.6510 238.0044 275.5208 169.3027 3.8773 13.7516 13.9414 20.5526 9.3879 4.1366 25.0908 8.5897 46.0229 115.6163 53.0284
temp: 298.150 k
press: 1.00000 atm
elementType: 8 7 7 7 7 7 6 6 6 6 6 6 6 6 6 6 6 1 1 1 1 1 1 1 1 1 1 1
symmnumber: 1
zpe: 560576.8 jmol-1
zpe.correction: 0.213512 hartree
zpe.thermalcorrener: 0.228226 hartree
zpe.thermalcorrenthalpy: 0.229170 hartree
zpe.thermalcorrgfe: 0.170746 hartree
zpe.sumelectzpe: -773.579097 hartree
zpe.sumelectthermal: -773.564383 hartree
zpe.sumelectthermalent: -773.563439 hartree
zpe.sumelectthermalfe: -773.621863 hartree
dipole: 3.0651 3.4384 -0.0045
dipole: 4.6063
quadrupole: -122.2701 -79.2801 -102.3818
quadrupole: -0.9148 -0.1005 -0.0010
quadrupole: -20.9595 22.0306 -1.0711 -0.9148 -0.1005 -0.0010
hfenergy: -773.7926092 hartree
pointgroup: C01 [X(C11H11N5O1)]
dipole: 1.1910806 1.364072 -0.0700306 debye
polarizability: 309.0896534|4.5947311|170.0861909|4.5540472|-6.7700009|67.8046653 unknown
InChI: InChI=1S/C11H11N5O/c1-7(17)8-2-4-9(5-3-8)15-11-14-6-13-10(12)16-11/h2-6,15H,12H2,1H3
charge 0 multiplicity 1
28 atoms
O  -5.438937 -0.529404 -0.092497
N  0.972907 -1.277125 0.088196
N  2.280974 0.730884 -0.024993
N  3.273011 -1.495644 0.155411
N  4.717419 0.457984 0.046911
N  3.726142 2.57354 -0.127905
C  -0.352473 -0.795715 0.02877
C  -3.089934 -0.000865 -0.076625
C  -0.690816 0.582455 -0.06241
C  -1.394024 -1.77101 0.066048
C  -2.045222 0.960687 -0.113456
C  -2.736179 -1.377081 0.014238
C  -4.541271 0.366478 -0.129886
C  2.193721 -0.627125 0.069758
C  -4.924875 1.841215 -0.230513
C  3.567995 1.219695 -0.032959
C  4.484337 -0.881928 0.138289
H  0.112233 1.319719 -0.090985
H  -1.137725 -2.83586 0.136162
H  -2.284727 2.027211 -0.183577
H  -3.544636 -2.114904 0.042095
H  1.093083 -2.292648 0.159887
H  -4.504911 2.299095 -1.145628
H  -4.538171 2.412076 0.634274
H  -6.021728 1.924691 -0.256533
H  5.365048 -1.52768 0.2047
H  2.908024 3.174291 -0.189813
H  4.668833 2.955869 -0.135259
