program: Gaussian 09
title: 000227739
version: EM64L-G09RevD.01
frameworkgroup: C1[X(C9H7Cl4NO2)]
method: RPBEPBE
basis: SDD
operation: Freq
keyword: #p
keyword: freq=noraman
keyword: PBEPBE/SDD
title: #p freq=noraman PBEPBE/SDD
converged: YES YES NO NO
title: Mulliken charges:
elementType: Cl Cl Cl Cl O O N C C C C C C C C C H H H H H H H
charge: 0.040307 0.005281 0.049603 0.015370 -0.336326 -0.253382 -0.132165 0.671314 -0.208011 -0.284798 0.312374 -0.089802 -0.243773 -0.100196 -0.602361 -0.612697 0.287272 0.230715 0.277707 0.230875 0.229020 0.228467 0.285206
chargesum: 0.00000
title: Mulliken charges with hydrogens summed into heavy atoms:
elementType: Cl Cl Cl Cl O O N C C C C C C C C C
charge: 0.040307 0.005281 0.049603 0.015370 -0.336326 -0.253382 -0.132165 0.671314 -0.208011 -0.284798 0.312374 -0.089802 0.043499 -0.100196 0.136936 0.129997
polarizability: 2.16746862e+02 2.82478214e+00 1.60412461e+02 -1.23193857e+01 1.65001905e+00 8.18739947e+01
1716.lowfreq: -5.5849 -0.0039 -0.0038 -0.0030 2.5864 5.1259 19.9046 31.3194 41.1896
frequency: 19.7678 31.3110 41.1819 71.8571 82.9863 104.4092 116.1316 126.3858 154.4266 163.8635 185.5195 201.4368 226.1353 245.7247 268.8371 291.0698 313.2909 330.8994 352.7122 363.5582 406.2275 490.1198 516.4107 529.9932 555.0051 607.7126 624.6834 669.3130 699.1922 732.2691 776.0454 779.4462 852.3908 887.0782 962.7992 1058.9995 1062.8044 1098.5112 1108.4122 1150.4477 1158.3447 1224.6925 1247.1946 1330.8997 1347.9356 1368.6924 1413.4448 1425.7960 1439.6604 1472.0949 1475.8878 1486.6616 1499.2847 1548.2602 1565.5345 1710.1788 2974.2263 2979.0210 3047.3660 3053.8446 3128.0484 3154.8271 3187.0019
redmass: 6.7030 4.2578 9.6480 25.5806 1.1455 11.5756 3.4348 1.0962 8.8263 9.9181 24.0973 30.3613 8.2853 2.9792 7.3096 10.5846 18.2480 5.4011 23.4718 6.9899 3.5592 6.8621 4.8344 7.6010 8.4182 9.8232 8.3849 11.9281 8.2596 10.2590 10.7929 10.5252 1.4076 7.8650 4.6423 3.2250 1.8593 1.2186 2.1824 1.3704 1.8971 4.9075 5.5479 8.7622 11.3269 3.2269 3.8107 1.1558 1.1882 1.0467 1.0426 1.0438 1.1732 10.3355 9.6594 9.4105 1.0371 1.0373 1.1017 1.1021 1.0981 1.0956 1.0934
irintensity: 0.0490 3.7670 0.9948 0.0549 0.2904 0.8159 0.9026 0.0063 0.7649 1.0865 0.0344 0.0128 0.0626 4.6889 2.0971 0.1666 1.2239 13.8970 0.4527 9.0654 4.0070 7.9771 6.6773 11.9430 0.6021 19.3355 5.1590 13.6649 1.7162 79.2306 42.9016 50.2120 20.3850 9.6385 122.0820 138.5271 15.4710 0.1914 492.5123 0.0918 12.1981 71.1606 6.2981 114.0410 14.6873 205.6006 140.3054 22.7837 4.8484 20.6318 0.2021 33.9941 16.3566 17.2638 15.0038 404.9974 25.5503 116.0861 37.8891 21.9237 2.0451 3.3323 2.3424
temp: 298.150 k
press: 1.00000 atm
elementType: 17 17 17 17 8 8 7 6 6 6 6 6 6 6 6 6 1 1 1 1 1 1 1
symmnumber: 1
zpe: 379804.0 jmol-1
zpe.correction: 0.144660 hartree
zpe.thermalcorrener: 0.161955 hartree
zpe.thermalcorrenthalpy: 0.162899 hartree
zpe.thermalcorrgfe: 0.096448 hartree
zpe.sumelectzpe: -2391.403621 hartree
zpe.sumelectthermal: -2391.386326 hartree
zpe.sumelectthermalent: -2391.385382 hartree
zpe.sumelectthermalfe: -2391.451833 hartree
dipole: 3.7689 0.4867 -1.8720
dipole: 4.2362
quadrupole: -98.4743 -118.0541 -123.8614
quadrupole: -6.0491 -3.1111 0.4218
quadrupole: 14.9890 -4.5908 -10.3981 -6.0491 -3.1111 0.4218
hfenergy: -2391.5482811 hartree
pointgroup: C01 [X(C9H7Cl4N1O2)]
dipole: 1.4632294 0.2627124 -0.7534346 debye
dipolederiv: -0.1740859 0.2506906 0.0353416 0.2482071 -0.5098007 -0.0521156 0.0263337 -0.0513457 -0.003672 -0.2872279 -0.2943631 0.0397503 -0.2977837 -0.5443753 0.0466296 0.0339685 0.0434106 -0.0279393 -0.2606701 -0.2935679 0.0224446 -0.3574208 -0.4310236 0.0331628 0.0339787 0.0348855 0.0085807 -0.7529561 0.0919946 0.0902239 0.1098026 -0.0790958 -0.0143817 0.1081366 -0.0139164 -0.0309258 -2.037477 0.1315512 -0.3261857 0.2538543 -0.2581028 0.0608942 -0.580502 0.0677778 -0.5996908 -0.8399777 0.0378666 0.1998718 0.0538207 -0.2951151 0.0146279 0.0964826 0.0051653 -1.0307008 -1.411178 0.0862955 0.1988289 0.1166524 -0.3055028 -0.0062616 0.1233623 -0.0034283 -0.5706359 1.2552483 -0.123711 0.0924985 -0.0884573 -0.1931322 -0.0051174 -0.1982069 0.0239148 0.0486725 0.0784174 -0.3595406 -0.0712485 -0.5040337 0.6542836 0.0940294 -0.0010657 0.052414 -0.0059748 0.3082863 0.4267814 -0.1010067 0.453043 0.8233378 -0.0632037 -0.05457 -0.0498609 -0.0497256 2.7268214 -0.2004218 -0.1544188 -0.3375955 0.2834869 -0.0531644 0.4745856 -0.0611597 1.4664162 0.068022 0.5676728 -0.0038883 0.6416411 0.4902157 -0.0741995 -0.0101337 -0.0763811 -0.0322359 -0.3846453 -0.0592028 0.0407906 -0.1008328 -0.2097679 0.0257555 0.0390719 0.0140704 -0.0495648 1.0483444 -0.2625277 -0.1494977 -0.1975228 0.0492262 0.0209913 -0.1682883 0.0384145 -0.0226562 0.4304735 -0.0241109 0.167574 -0.0385228 0.2564746 -0.0075157 0.4074183 -0.0259891 0.0905972 0.1519519 0.0282333 -0.1946524 0.0341339 0.2580145 0.0184215 -0.346226 0.0301951 0.367121 0.0766328 0.0136649 0.0087428 0.0176364 0.0454483 -0.0036753 0.0175726 -0.0030573 0.1694097 -0.0541041 0.0804021 -0.0348529 0.1563628 -0.089244 -0.023104 -0.0114238 -0.0760237 0.0874039 0.1411873 -0.0063717 0.0945699 -0.002198 0.1262605 -0.0007267 0.0013439 0.0095864 -0.0157106 -0.1073094 -0.0787955 -0.0436903 -0.1540886 -0.049977 0.0087188 -0.0171071 0.0554402 0.0973432 0.0041636 0.081346 0.0947207 0.1420171 -0.0926841 -0.0836347 0.0749634 -0.0016053 0.0269151 -0.0582303 -0.1089625 0.0969375 -0.1611655 -0.0415294 0.0461972 0.052357 -0.0250832 0.0346842 0.078313 0.0150765 -0.1028539 0.0124499 0.1126025 0.0176723 -0.1020513 0.0125762 0.0422889 unknown
polarizability: 216.0203595|5.8474641|160.9438651|-13.543847|-0.8162709|82.0690931 unknown
InChI: InChI=1S/C9H7Cl4NO2/c1-14(2)9(15)16-8-5(11)3-4(10)6(12)7(8)13/h3H,1-2H3
charge 0 multiplicity 1
23 atoms
Cl -0.128263 -2.544278 -0.372502
Cl 0.291876 2.974988 -0.361296
Cl -3.333471 -2.307471 0.105884
Cl -4.671436 0.65277 0.34082
O  1.252686 0.110818 -0.627471
O  1.713998 -0.085907 1.689648
N  3.435429 -0.188746 0.083607
C  -0.112714 0.220965 -0.341559
C  -0.92234 -0.936443 -0.233601
C  -0.725119 1.488733 -0.233934
C  2.1422 -0.065016 0.514816
C  -2.317336 -0.830954 -0.025827
C  -2.108927 1.618805 -0.027917
C  -2.895887 0.455716 0.074793
C  4.494032 -0.373692 1.091922
C  3.856861 -0.150276 -1.326663
H  -2.56975 2.605546 0.055409
H  5.026811 -1.327298 0.916755
H  4.039023 -0.392226 2.093004
H  5.223929 0.456043 1.039171
H  4.352925 -1.100834 -1.600968
H  4.573463 0.678105 -1.485237
H  2.98631 0.000052 -1.976656
