program: Gaussian 09
title: 000021476
version: EM64L-G09RevD.01
frameworkgroup: C1[X(C10H12)]
method: RPBEPBE
basis: SDD
operation: Freq
keyword: #p
keyword: freq=noraman
keyword: PBEPBE/SDD
title: #p freq=noraman PBEPBE/SDD
converged: YES YES NO NO
title: Mulliken charges:
elementType: C C C C C C C C C C H H H H H H H H H H H H
charge: 0.470019 0.458692 0.503923 -0.541084 -0.592595 -0.579007 -0.815472 -0.812488 -0.208006 -0.578437 0.234119 0.227624 0.230405 0.228300 0.229936 0.223643 0.223510 0.224547 0.234805 0.211949 0.213441 0.212176
chargesum: 0.00000
title: Mulliken charges with hydrogens summed into heavy atoms:
elementType: C C C C C C C C C C
charge: 0.470019 0.458692 0.503923 -0.306965 -0.364971 -0.348602 -0.133594 -0.129626 0.003944 -0.152820
polarizability: 1.61080465e+02 2.55501991e+00 1.20586414e+02 -1.43356345e-01 -6.21973932e-02 5.36890813e+01
1716.lowfreq: -17.0560 -0.0003 0.0002 0.0007 9.9147 11.7917 13.8899 28.7077 70.2594
frequency: -14.1073 28.5184 70.1941 172.3338 186.8105 212.9167 230.9364 261.2417 373.4527 466.0614 485.2788 502.8940 520.3153 535.5104 591.8961 666.4980 738.5781 872.9945 891.3835 912.7714 915.8000 927.9837 944.3225 987.7594 997.3078 1011.1593 1018.2351 1045.6218 1052.6995 1067.5108 1172.3227 1182.5688 1287.6307 1309.3175 1317.9855 1379.8527 1396.0107 1397.1147 1422.1556 1440.2766 1450.2161 1469.8971 1473.5988 1480.0539 1488.8550 1607.3697 1613.7541 1645.7883 2974.7503 2975.9672 3054.2780 3056.1081 3083.6537 3084.1546 3084.8081 3102.0205 3107.4587 3111.4215 3129.7593 3202.4664
redmass: 1.0257 1.0165 2.5107 2.5267 3.1015 2.7448 2.6840 2.5258 2.9186 3.7394 2.2437 4.6538 3.0531 4.1583 2.9821 2.1448 1.6496 1.5307 1.3392 2.5990 1.5106 1.3482 3.2082 5.7670 1.5019 1.1686 1.5234 1.5386 1.6089 1.6549 1.5107 1.3816 1.2803 4.8980 1.2598 5.7071 1.2381 1.2541 1.9852 1.6345 1.7284 1.0464 1.0568 1.2051 1.3748 5.5961 5.7188 4.4273 1.0383 1.0372 1.0975 1.0952 1.0988 1.0993 1.0806 1.0714 1.0910 1.0917 1.0909 1.1140
irintensity: 0.4601 0.5166 0.0555 7.1582 0.4016 0.0224 0.0990 0.8855 0.0745 0.5763 0.5608 1.7899 0.0869 1.2250 1.2779 16.2221 3.0005 24.7820 3.0249 1.5024 0.2960 84.7721 3.4686 0.1821 9.0736 19.4867 1.0137 2.3672 33.4195 1.9786 3.0953 2.4607 0.1826 5.7183 1.1829 0.3961 18.2712 8.1691 3.5868 3.5550 3.8802 14.5296 11.8171 17.2256 22.1528 41.1445 16.6608 15.4301 43.5949 30.2663 20.2023 25.3273 13.9390 14.9963 24.4217 4.3119 30.8452 14.3681 9.4235 25.6309
temp: 298.150 k
press: 1.00000 atm
elementType: 6 6 6 6 6 6 6 6 6 6 1 1 1 1 1 1 1 1 1 1 1 1
symmnumber: 1
zpe: 485627.6 jmol-1
zpe.correction: 0.184966 hartree
zpe.thermalcorrener: 0.194716 hartree
zpe.thermalcorrenthalpy: 0.195660 hartree
zpe.thermalcorrgfe: 0.149109 hartree
zpe.sumelectzpe: -387.523290 hartree
zpe.sumelectthermal: -387.513540 hartree
zpe.sumelectthermalent: -387.512596 hartree
zpe.sumelectthermalfe: -387.559147 hartree
dipole: -0.8098 0.0880 0.0724
dipole: 0.8178
quadrupole: -54.9006 -53.0337 -65.6462
quadrupole: 0.1456 -0.1227 -0.0263
quadrupole: 2.9596 4.8265 -7.7861 0.1456 -0.1227 -0.0263
hfenergy: -387.708256 hartree
pointgroup: C01 [X(C10H12)]
dipole: 0.3192648 0.0234552 -0.0320905 debye
dipolederiv: 0.0334148 0.1464888 0.0042161 0.1868672 0.3788235 0.0070223 0.0058746 -0.0088978 -0.0006853 0.2698855 -0.2235017 -0.021791 -0.2377946 0.1981134 0.0208427 -0.0694961 0.0657719 0.0012165 0.1314598 -0.0208894 -0.0034622 -0.0416922 0.0418234 -0.0027989 0.0054236 -0.0050644 0.0874612 -0.0393695 0.0713665 -0.0062317 0.0251221 -0.2690457 -0.0063061 -0.0020173 -0.0081393 -0.2182996 -0.1515712 -0.1555808 -0.0009651 -0.096897 -0.1636458 -0.0009863 -0.0024304 0.0028378 -0.2016277 -0.2469704 0.1688319 0.0079609 0.0505009 -0.0192482 0.0103571 0.0100378 0.0026306 -0.2289888 0.0262661 -0.1225167 -0.0023287 -0.066073 -0.1054574 -0.0015266 0.0037849 0.0125581 0.0670793 -0.0211167 0.1040623 0.0120035 0.109573 -0.0410862 -0.0125569 0.0791677 -0.0802393 0.0617635 0.3791215 0.0333755 -0.0050805 0.1864053 0.1739006 0.0034925 -0.0040749 0.0065054 -0.1491197 -0.331582 0.0598146 -0.0000838 0.1269492 0.0594278 0.0044538 0.0003552 0.0058985 -0.413943 -0.1225141 -0.0505136 0.000574 -0.0527334 0.0769341 0.001612 -0.0052728 0.0000227 0.1461166 0.0031125 0.1079181 0.0038052 0.0884012 -0.0236475 -0.0053197 0.0030235 -0.0052205 0.1443091 0.0680879 -0.0640324 -0.003166 -0.0522082 -0.1110763 -0.0039514 -0.0023846 0.0011645 0.1518131 0.0068875 -0.0596815 -0.1210343 -0.0278377 0.0199946 -0.0093123 -0.1214993 -0.076804 -0.0346321 0.0354692 -0.0602817 0.1065219 -0.0404487 0.0062862 0.0205837 0.1107048 0.086608 -0.0554611 -0.0543646 0.1670302 0.0166753 0.0473281 -0.0175391 -0.0086656 0.0083016 -0.014488 0.1048285 -0.1060188 -0.0008423 -0.079555 -0.0947405 0.0479143 -0.0503698 -0.1027606 -0.0021992 0.0678596 0.0501588 -0.0786541 0.0561107 0.0058205 -0.0901931 0.0884024 0.00226 0.1134836 0.0552869 0.0428496 0.0673402 0.032073 0.0708553 0.0380208 -0.0472237 0.0777873 -0.0866229 -0.1076386 0.0370947 0.0190843 0.0014873 -0.0886971 -0.1379051 -0.0032323 0.0002196 -0.0046654 0.1496569 -0.1085847 -0.0612856 0.0022938 -0.0789449 0.0538487 -0.0008672 0.0021567 -0.0016331 0.187443 0.0982841 -0.0475325 -0.0000234 -0.0197554 -0.1162431 -0.0036499 0.0008387 -0.0035072 0.1855617 unknown
polarizability: 160.8101384|-4.0235726|120.7867346|-1.6435263|1.7980413|53.7590866 unknown
InChI: InChI=1S/C10H12/c1-4-10-6-8(2)5-9(3)7-10/h4-7H,1H2,2-3H3
charge 0 multiplicity 1
22 atoms
C  0.758054 1.379185 0.055681
C  1.381744 -1.015355 -0.003887
C  -1.004379 -0.351408 0.036725
C  1.741135 0.35268 0.025458
C  -0.605176 1.014978 0.061145
C  0.005339 -1.349533 0.006701
C  1.179414 2.839348 0.083015
C  2.443722 -2.100618 -0.067563
C  -2.420412 -0.779572 0.046081
C  -3.528162 0.0126 0.068009
H  2.804079 0.629186 0.026112
H  -1.366278 1.803655 0.088761
H  -0.291721 -2.406998 -0.007601
H  1.845351 3.049219 0.941001
H  1.735122 3.113565 -0.833828
H  0.307515 3.511345 0.160409
H  3.393081 -1.765551 0.38592
H  2.118585 -3.016436 0.45733
H  2.661162 -2.383123 -1.11616
H  -2.571295 -1.86974 0.032247
H  -4.532829 -0.422625 0.072293
H  -3.472052 1.107297 0.081551
