program: Gaussian 09
title: 000227729
version: EM64L-G09RevD.01
frameworkgroup: C1[X(C7H16N2OS2)]
method: RPBEPBE
basis: SDD
operation: Freq
keyword: #p
keyword: freq=noraman
keyword: PBEPBE/SDD
title: #p freq=noraman PBEPBE/SDD
converged: YES YES NO NO
title: Mulliken charges:
elementType: S S O N N C C C C C C C H H H H H H H H H H H H H H H H
charge: 0.045795 -0.010851 -0.183891 -0.042354 -0.070453 -0.537369 -0.297212 -0.589219 -0.589626 -0.592844 -0.592924 -0.364507 0.292808 0.295640 0.248538 0.249210 0.224133 0.225655 0.234092 0.234900 0.225209 0.224714 0.222759 0.241347 0.221257 0.222582 0.221211 0.241398
chargesum: 0.00000
title: Mulliken charges with hydrogens summed into heavy atoms:
elementType: S S O N N C C C C C C C
charge: 0.045795 -0.010851 -0.183891 -0.042354 -0.070453 0.051079 0.200536 0.094661 0.095197 0.092520 0.092268 -0.364507
polarizability: 2.02447147e+02 -2.67630551e-02 1.39117784e+02 -9.59067623e-02 2.45519262e-01 9.11761852e+01
1716.lowfreq: -6.5288 -0.0014 0.0028 0.0030 2.9834 8.7689 11.6754 20.2887 39.4874
frequency: 11.4075 20.2133 39.4685 57.8219 59.8554 102.9722 127.1105 142.4798 159.2627 161.7299 181.2722 182.4277 195.5876 205.9149 289.4810 308.3390 347.2023 381.7560 405.5077 437.1101 442.4955 450.0321 513.1447 529.1843 578.2547 627.1957 826.5949 834.7093 881.7662 950.7173 973.7366 1048.6752 1052.1569 1081.4999 1083.2617 1084.1663 1097.1424 1110.0181 1134.9057 1135.2162 1141.3096 1157.4341 1206.7695 1299.2913 1306.7714 1311.6908 1360.9756 1371.9685 1413.5852 1424.7751 1424.8467 1429.0122 1457.7600 1458.3700 1459.0299 1465.6388 1471.0505 1471.8722 1475.2976 1482.5957 1499.8329 1507.4358 2929.9110 2936.0673 2951.3811 2956.3418 3033.3665 3041.4814 3042.4589 3044.3279 3044.7603 3071.4038 3087.9386 3092.5565 3095.0199 3099.1269 3125.5392 3169.7318
redmass: 3.7190 3.4852 3.3953 4.3678 3.8363 2.7590 3.4143 4.5613 2.4294 3.9754 1.0290 1.0466 1.1750 1.4339 6.1943 5.5568 6.0667 2.6708 2.6915 1.9015 5.6836 1.9071 12.5078 5.9224 8.0309 14.4954 3.9800 3.9596 1.4190 9.5245 1.5715 1.5811 1.5433 1.3322 1.8291 1.3434 1.7345 1.2319 1.2497 1.6921 1.4725 1.9359 1.1519 1.3355 2.4568 2.2533 2.3626 2.5410 1.1999 1.1388 1.1382 1.1469 1.1994 1.0423 1.0451 1.1410 1.0490 1.1197 1.0503 1.0505 1.1650 1.1864 1.0465 1.0473 1.0393 1.0404 1.0565 1.0852 1.0854 1.0937 1.0944 1.0576 1.1008 1.1006 1.1011 1.1012 1.1146 1.1154
irintensity: 0.0012 1.4311 0.0182 0.2595 8.4387 4.6731 3.0552 16.2490 8.4119 3.5953 0.1381 0.8112 2.4814 27.0234 0.8750 139.3423 105.3895 59.5759 15.8875 0.3822 68.8920 0.9617 0.2754 163.8044 82.5087 252.8912 20.0977 17.2553 5.9296 470.4696 1.3470 12.5789 14.0603 66.3905 536.7937 100.2800 54.3105 0.3600 4.4374 73.8853 36.2570 152.4056 96.9758 5.6700 4.8538 6.5134 125.2966 58.3863 4.3344 3.4519 10.2515 1.6675 3.6539 5.9053 7.8858 29.8376 44.6878 9.2042 9.9399 13.3998 65.9697 50.9611 46.4151 78.8419 54.2685 79.4459 18.3056 38.2550 55.2903 55.4153 24.5792 3.3306 11.9060 48.5650 11.8666 34.3337 15.5189 3.8332
temp: 298.150 k
press: 1.00000 atm
elementType: 16 16 8 7 7 6 6 6 6 6 6 6 1 1 1 1 1 1 1 1 1 1 1 1 1 1 1 1
symmnumber: 1
zpe: 601545.3 jmol-1
zpe.correction: 0.229117 hartree
zpe.thermalcorrener: 0.245965 hartree
zpe.thermalcorrenthalpy: 0.246909 hartree
zpe.thermalcorrgfe: 0.181063 hartree
zpe.sumelectzpe: -1256.160681 hartree
zpe.sumelectthermal: -1256.143832 hartree
zpe.sumelectthermalent: -1256.142888 hartree
zpe.sumelectthermalfe: -1256.208734 hartree
dipole: 0.6860 -4.7420 0.0075
dipole: 4.7914
quadrupole: -62.7388 -99.3530 -84.0544
quadrupole: -1.3038 0.0418 -0.1331
quadrupole: 19.3099 -17.3043 -2.0056 -1.3038 0.0418 -0.1331
hfenergy: -1256.389797 hartree
pointgroup: C01 [X(C7H16N2O1S2)]
dipole: 0.460225 -1.0925946 1.4655958 debye
polarizability: 201.0420853|-3.5122995|107.8890752|-10.5012923|-22.5802754|123.8099547 unknown
InChI: InChI=1S/C7H16N2OS2/c1-8(2)5-10-7(11)12-6-9(3)4/h5-6H2,1-4H3
charge 0 multiplicity 1
28 atoms
S  0.914227 -0.59832 -0.206198
S  -0.088075 1.230717 -2.545121
O  -1.659617 0.085992 -0.732802
N  3.796218 -0.463782 -0.727152
N  -3.388098 -0.821926 0.76081
C  2.59932 -0.005477 -1.288274
C  -2.007538 -0.836726 0.556724
C  4.118467 -1.895051 -0.858787
C  4.267189 0.17833 0.512326
C  -4.232808 -1.564059 -0.195316
C  -3.990928 0.414525 1.295708
C  -0.38309 0.263181 -1.176145
H  2.368782 -0.426911 -2.275383
H  2.474879 1.085354 -1.275994
H  -1.440569 -0.3731 1.379552
H  -1.617508 -1.83066 0.285979
H  3.578223 -2.518323 -0.112096
H  5.203892 -2.0461 -0.722155
H  3.841484 -2.246586 -1.866765
H  4.094709 1.266085 0.455777
H  5.350683 0.001913 0.633404
H  3.742376 -0.210421 1.412852
H  -3.737848 -2.511135 -0.470328
H  -4.420556 -0.987239 -1.124755
H  -5.202709 -1.802938 0.276691
H  -3.332915 0.842964 2.071074
H  -4.965916 0.179248 1.758888
H  -4.146076 1.181147 0.508183
