program: Gaussian 09
title: 000227726
version: EM64L-G09RevD.01
frameworkgroup: C1[X(C12H29N2O2P)]
method: RPBEPBE
basis: SDD
operation: Freq
keyword: #p
keyword: freq=noraman
keyword: PBEPBE/SDD
title: #p freq=noraman PBEPBE/SDD
converged: YES YES NO NO
title: Mulliken charges:
elementType: P O O N N C C C C C C C C C C C C H H H H H H H H H H H H H H H H H H H H H H H H H H H H H
charge: 1.375299 -0.532185 -0.632026 -0.493321 -0.475452 0.008685 -0.422389 -0.327075 -0.407941 -0.364543 -0.354944 -0.737679 -0.697881 -0.564630 -0.578172 -0.567964 -0.580678 0.202969 0.182437 0.199910 0.203904 0.233078 0.211107 0.202541 0.188014 0.205121 0.192791 0.196243 0.275680 0.207206 0.205771 0.209611 0.210956 0.215253 0.229482 0.221803 0.246678 0.217774 0.272793 0.218680 0.256047 0.222138 0.217380 0.212042 0.277120 0.218365
chargesum: 0.00000
title: Mulliken charges with hydrogens summed into heavy atoms:
elementType: P O O N N C C C C C C C C C C C C
charge: 1.375299 -0.532185 -0.632026 -0.493321 -0.475452 0.211653 -0.040042 0.109907 0.005706 0.028591 0.034091 -0.049021 -0.062059 0.133333 0.131075 0.127601 0.126849
polarizability: 2.13250071e+02 -1.04256509e+00 1.67466102e+02 -2.84705599e+00 -1.15325925e+00 1.48630769e+02
1716.lowfreq: -15.2309 -5.4284 -0.0010 0.0013 0.0017 13.0803 22.0395 24.0260 36.9333
frequency: 21.1252 22.6688 36.7442 49.8506 60.9652 72.3171 75.5519 86.1838 102.0838 106.2046 121.5252 139.0975 161.5179 170.9892 184.0882 185.5847 188.4444 206.4446 226.3024 230.6392 233.9371 254.5339 276.4556 278.5851 292.0803 304.2980 318.4410 330.4496 363.6870 399.4049 415.9382 430.2415 460.7752 494.1490 530.6892 582.2929 684.2853 703.0821 727.7484 758.9697 770.9727 805.3021 887.5357 910.5048 932.5464 960.5738 963.9110 967.0515 975.4620 998.9861 1015.3408 1026.4502 1039.9245 1060.5233 1064.9932 1077.7494 1092.4953 1093.3400 1094.5751 1133.6164 1135.1107 1136.4998 1150.5419 1160.5083 1196.0139 1209.0827 1213.1584 1225.5020 1247.8915 1263.3316 1271.5689 1276.7900 1279.0885 1286.8105 1292.9786 1332.0629 1340.9975 1352.6512 1359.4992 1370.3524 1390.3263 1401.7142 1418.2200 1421.1816 1432.9148 1438.0653 1457.7137 1463.2027 1464.8132 1468.8040 1471.3553 1474.9457 1477.5519 1477.7649 1478.0143 1478.5847 1479.6588 1482.3029 1485.5411 1491.6110 1495.5996 1498.2890 1503.5746 2938.3252 2939.8743 2942.9342 2946.3768 2953.2298 2956.8737 2957.5430 2966.7207 2971.8795 2973.9304 2978.5247 2986.4331 2995.6979 3007.4963 3015.8734 3018.9441 3022.2818 3025.4635 3027.9076 3034.8109 3044.3469 3064.9185 3068.5480 3070.3387 3078.3573 3090.4818 3091.4525 3093.8501 3124.2522
redmass: 3.2341 3.7261 3.1907 2.7191 1.6649 3.2951 2.7080 2.8658 2.6751 2.8104 2.3684 2.3666 1.8456 2.4082 1.3304 1.9356 1.0657 1.3778 1.7537 1.2321 2.3320 1.5486 2.3191 3.5888 3.7407 2.0544 3.4521 2.9204 3.6933 4.4188 3.5627 3.3237 3.2574 3.1012 2.3733 5.0312 6.9154 8.5673 1.0992 1.5849 1.4895 1.3555 1.8216 1.3286 4.7310 2.3813 2.4424 2.5252 2.3540 1.8186 5.6230 1.4378 2.4731 1.3883 1.3474 2.3968 2.0681 1.2154 1.2158 1.8361 1.3531 1.3711 2.1821 2.3433 5.5479 1.4844 6.1155 1.1883 1.2257 1.2120 2.2270 2.1759 1.1654 1.0708 1.2840 1.4568 1.5284 1.4243 1.4498 1.3047 1.2178 1.2090 1.1243 1.1241 1.1416 1.1453 1.0756 1.0448 1.0703 1.0717 1.0451 1.0646 1.0437 1.0495 1.0508 1.0640 1.0475 1.0524 1.0658 1.0712 1.0593 1.0561 1.0493 1.0381 1.0412 1.0389 1.0401 1.0592 1.0704 1.0695 1.0602 1.0363 1.0387 1.0545 1.0666 1.0921 1.1013 1.0978 1.0988 1.0959 1.0974 1.0996 1.1041 1.1076 1.0984 1.1006 1.0993 1.1010 1.0975 1.0970 1.0976 1.0954
irintensity: 0.3848 0.4133 0.5964 0.3703 0.0563 1.4109 2.1748 0.3056 2.1259 1.5112 2.3116 1.7010 0.4762 1.1609 1.6636 1.2307 0.2289 0.1572 0.4960 1.5352 7.0970 0.3754 2.4420 28.7758 3.7006 0.2792 20.4899 5.5742 2.6766 13.9945 13.3447 5.7421 3.0008 11.2176 2.1342 4.9434 101.1272 212.2745 8.1946 3.8210 14.1941 4.9116 28.7573 4.2722 257.7156 18.2477 179.8801 82.1309 4.3314 79.0851 109.6049 2.4605 0.6279 9.4168 7.5276 2.1223 19.8589 0.4953 0.0309 2.3760 0.1687 0.2978 0.6467 0.7413 59.3474 1.0615 41.9068 0.6202 2.2258 1.1801 12.2873 14.8407 2.8744 0.7874 1.3006 0.2950 3.0060 0.2190 0.5987 4.3414 11.9335 22.1845 10.1064 15.2472 2.5379 2.0716 1.0555 2.4776 0.5784 1.5148 1.8488 6.2786 14.3313 1.9079 26.7841 23.9361 28.3918 45.5317 16.9341 2.9832 4.5779 1.1622 7.7491 47.3279 55.9013 204.5948 73.1091 7.3134 7.7351 6.3049 72.3232 39.1530 28.6098 71.9056 32.0745 25.7187 3.7089 99.2070 0.2397 84.9001 4.0388 39.2635 44.7632 54.9166 58.0457 84.7557 54.1385 21.5983 25.5006 0.6319 3.6530 5.1657
temp: 298.150 k
press: 1.00000 atm
elementType: 15 8 8 7 7 6 6 6 6 6 6 6 6 6 6 6 6 1 1 1 1 1 1 1 1 1 1 1 1 1 1 1 1 1 1 1 1 1 1 1 1 1 1 1 1 1
symmnumber: 1
zpe: 1060490.0 jmol-1
zpe.correction: 0.403919 hartree
zpe.thermalcorrener: 0.428007 hartree
zpe.thermalcorrenthalpy: 0.428951 hartree
zpe.thermalcorrgfe: 0.348658 hartree
zpe.sumelectzpe: -1074.382870 hartree
zpe.sumelectthermal: -1074.358782 hartree
zpe.sumelectthermalent: -1074.357838 hartree
zpe.sumelectthermalfe: -1074.438131 hartree
dipole: 1.2695 -0.8159 -2.6552
dipole: 3.0541
quadrupole: -103.0269 -107.7822 -123.1275
quadrupole: 0.0272 -4.9676 -1.5194
quadrupole: 8.2853 3.5300 -11.8153 0.0272 -4.9676 -1.5194
hfenergy: -1074.7867891 hartree
pointgroup: C01 [X(C12H29N2O2P1)]
dipole: 0.4761241 -0.5291149 -0.9680676 debye
polarizability: 212.6169065|-5.9529387|167.3900978|-1.2837303|-3.9151813|149.3399374 unknown
InChI: InChI=1S/C12H29N2O2P/c1-7-9-10-12(8-2)11-16-17(15,13(3)4)14(5)6/h12H,7-11H2,1-6H3
charge 0 multiplicity 1
46 atoms
P  2.119539 -0.280482 0.378948
O  0.735973 -0.321018 -0.695496
O  1.70956 0.055169 1.894044
N  3.107643 0.778766 -0.580519
N  2.992598 -1.780813 0.317594
C  -1.690224 0.180755 -0.478741
C  -3.041565 -0.485261 -0.088065
C  -0.554735 -0.801526 -0.131595
C  -1.477505 1.587337 0.147405
C  -4.294732 0.340714 -0.455228
C  -5.612286 -0.419794 -0.178712
C  -1.462236 1.634616 1.693169
C  -6.869651 0.409512 -0.517888
C  4.516288 0.963727 -0.179573
C  2.5263 1.900272 -1.3431
C  3.403792 -2.369207 -0.96635
C  2.982781 -2.675898 1.486715
H  -1.68583 0.305699 -1.583355
H  -3.108878 -1.47185 -0.594368
H  -3.053951 -0.697212 1.001192
H  -0.752139 -1.78905 -0.591037
H  -0.459764 -0.920606 0.965778
H  -0.5180 1.990286 -0.23093
H  -2.26572 2.264173 -0.237198
H  -4.25185 0.6212 -1.5288
H  -4.302171 1.290214 0.116279
H  -5.619485 -1.362201 -0.763963
H  -5.64165 -0.717965 0.889492
H  -0.604583 1.072443 2.104271
H  -1.364646 2.679802 2.040858
H  -2.395127 1.22857 2.127319
H  -6.878799 0.697099 -1.586361
H  -6.902887 1.340351 0.079297
H  -7.796817 -0.1567 -0.312399
H  4.652887 1.85298 0.471264
H  5.138137 1.095419 -1.085766
H  4.875606 0.072417 0.361497
H  2.518609 2.845061 -0.758668
H  1.499266 1.650413 -1.645616
H  3.13225 2.060404 -2.255658
H  3.414399 -1.591297 -1.747725
H  2.71911 -3.183116 -1.285455
H  4.424755 -2.78943 -0.876769
H  2.322389 -3.55457 1.328164
H  2.624958 -2.114005 2.365433
H  4.008291 -3.042598 1.688619
