program: Gaussian 09
title: 000227719
version: EM64L-G09RevD.01
frameworkgroup: C1[X(C17H28N2O3)]
method: RPBEPBE
basis: SDD
operation: Freq
keyword: #p
keyword: freq=noraman
keyword: PBEPBE/SDD
title: #p freq=noraman PBEPBE/SDD
converged: YES YES NO NO
title: Mulliken charges:
elementType: O O O N N C C C C C C C C C C C C C C C C C H H H H H H H H H H H H H H H H H H H H H H H H H H H H
charge: -0.270374 -0.326452 -0.300592 -0.411775 -0.004813 -0.362788 -0.347153 -0.393331 -0.354678 -0.278383 -0.272398 -0.429177 -0.694312 -0.245906 -0.271739 -0.343321 0.178797 0.227688 -0.258426 -0.449713 -0.180492 -0.338528 0.187474 0.188834 0.189129 0.189718 0.211637 0.208490 0.195679 0.195180 0.195958 0.187631 0.193580 0.219836 0.202895 0.234165 0.216137 0.209855 0.210206 0.207073 0.198183 0.207506 0.224532 0.217368 0.255301 0.377656 0.288382 0.238502 0.233090 0.243872
chargesum: 0.00000
title: Mulliken charges with hydrogens summed into heavy atoms:
elementType: O O O N N C C C C C C C C C C C C C C C C C
charge: -0.270374 -0.326452 -0.300592 -0.034119 -0.004813 0.013519 0.031694 0.026795 0.036181 0.105206 0.141017 0.007884 -0.058114 0.159349 0.160300 0.129348 0.178797 0.227688 0.029956 -0.211211 0.052597 -0.094657
polarizability: 2.46555615e+02 -1.58570198e+01 2.41734622e+02 -1.91488494e+01 -4.68788920e-01 1.40195541e+02
1716.lowfreq: -6.1521 -4.4700 -0.0006 0.0002 0.0009 1.5733 5.8997 9.5837 10.5083
frequency: 3.6013 5.7305 9.0146 17.0626 28.7210 36.5586 54.8737 58.8654 70.0762 73.5182 90.2770 93.0602 126.0931 128.9640 136.7191 146.4766 194.2372 200.2509 222.8871 223.7311 251.2005 264.7584 274.1885 302.7431 317.3276 349.1622 358.5974 382.4705 419.9610 440.7741 455.5030 467.3451 498.7566 558.6004 609.7234 686.1065 695.5385 717.9478 725.3198 743.5472 747.8686 773.6596 801.3046 805.8643 824.4990 836.0731 874.8647 879.2024 887.8579 894.0621 908.7250 913.2309 936.5797 960.2175 988.9501 1002.5011 1006.6138 1012.4198 1012.6172 1024.1828 1025.4186 1040.4747 1054.5864 1059.3111 1073.2536 1086.2170 1096.0952 1103.4842 1109.2431 1120.2060 1141.6174 1148.1820 1166.8801 1188.7074 1193.5657 1199.4542 1215.9574 1238.9828 1242.1552 1244.0361 1254.8204 1275.8320 1277.2159 1289.8355 1292.1258 1296.2726 1301.1639 1312.3968 1324.3585 1339.0320 1341.4589 1348.4766 1356.7577 1361.2642 1373.0439 1378.1005 1387.8605 1389.0809 1406.2796 1444.2977 1455.5849 1460.7862 1464.9206 1467.0322 1471.2093 1472.7176 1476.0830 1477.9365 1478.9757 1486.2748 1490.8192 1491.3008 1531.4582 1543.5464 1583.3021 1597.2942 2925.6651 2946.8164 2954.4797 2957.6564 2958.2103 2958.9759 2969.1722 2972.3396 2976.1264 2985.5661 2990.4911 2991.3077 2995.7706 3007.4259 3011.0948 3031.3358 3049.7832 3052.5946 3058.1048 3065.0661 3068.8738 3071.7527 3082.0686 3111.8152 3132.9662 3152.2374 3170.4107 3412.6395
redmass: 2.8980 3.7375 3.3665 4.6833 3.8100 3.1401 4.2207 3.5918 2.6931 2.6419 2.9024 2.6995 3.4273 2.6626 1.9077 4.7924 3.7247 2.7459 1.3497 2.7780 3.6927 5.6070 5.0907 1.8794 3.4323 3.5123 4.1248 2.8316 3.4678 4.8297 2.9797 4.7188 2.6038 3.3421 7.8604 6.9458 3.7018 1.7779 1.0666 1.3293 1.0958 2.2262 1.1582 1.2712 4.2403 1.7881 1.8069 2.6260 1.2285 2.3996 2.3869 1.4491 2.3061 1.4500 1.1475 4.3356 5.0624 3.7129 1.3741 3.6171 4.8923 3.4866 3.2940 3.7667 2.7361 2.1210 2.0737 1.8316 1.9000 2.3909 1.6010 1.7083 2.5051 1.1691 1.5510 1.3994 1.2088 1.3012 1.2709 1.2931 1.2110 1.1075 1.1358 1.1166 1.0906 1.3070 1.9520 8.6820 1.1906 1.3539 1.4391 1.4322 1.6349 1.5919 1.3132 1.3035 1.3777 1.2187 1.9628 1.0887 1.7533 1.1402 1.0711 1.0736 1.0834 1.0740 1.0436 1.0965 1.0763 1.0822 1.0737 1.0932 1.7518 5.8736 5.5089 7.3030 1.0549 1.0555 1.0590 1.0652 1.0683 1.0592 1.0591 1.0365 1.1040 1.0643 1.0779 1.0783 1.0804 1.1017 1.0873 1.1044 1.0926 1.0970 1.1046 1.1020 1.1008 1.0993 1.1036 1.0905 1.0887 1.0916 1.0998 1.0808
irintensity: 0.3562 0.3191 2.2799 0.0663 1.3776 0.9225 2.0348 0.5143 0.5415 2.7026 2.3942 0.2872 1.5261 0.9841 0.5205 2.9088 1.3324 0.9085 0.1889 1.0347 8.3187 23.7526 14.4178 0.8164 0.5999 2.2273 2.4526 0.0943 4.1941 2.7714 2.2741 3.0581 1.7630 0.6899 3.3214 3.8080 15.4240 20.5702 11.4599 111.5733 0.0258 15.1955 2.0065 0.7160 8.7743 24.0695 7.0081 16.4350 1.4865 1.7267 0.5902 4.4875 10.0515 0.8211 0.3558 8.6246 67.3706 4.9073 1.1036 4.9722 123.6102 12.2807 134.8026 14.4733 16.0819 2.7456 14.7702 11.0069 10.9891 2.5510 1.5546 1.3935 8.1835 1.9315 0.1104 0.6592 7.7056 1.9493 16.0124 1.9766 42.2233 0.2364 1.8216 0.1141 0.8781 0.7154 73.8062 3.4606 2.1915 0.5902 0.5636 8.8409 0.2691 10.7254 2.0768 13.8027 2.8485 13.5979 21.7626 19.5858 53.8499 5.7298 0.0529 0.1642 6.0627 3.0166 12.6652 12.6163 0.8127 9.4353 15.2529 20.2213 364.8866 18.9017 24.6103 140.6860 34.8724 54.7194 0.4616 27.0179 55.4236 14.8870 91.7090 36.4140 25.1904 84.4392 23.8049 25.5356 7.4916 0.2768 74.2036 30.1336 22.8041 6.6369 69.4708 35.0225 110.9161 52.3233 50.0896 29.3457 7.9985 9.0317 22.7504 307.3064
temp: 298.150 k
press: 1.00000 atm
elementType: 8 8 8 7 7 6 6 6 6 6 6 6 6 6 6 6 6 6 6 6 6 6 1 1 1 1 1 1 1 1 1 1 1 1 1 1 1 1 1 1 1 1 1 1 1 1 1 1 1 1
symmnumber: 1
zpe: 1124723.4 jmol-1
zpe.correction: 0.428385 hartree
zpe.thermalcorrener: 0.453513 hartree
zpe.thermalcorrenthalpy: 0.454457 hartree
zpe.thermalcorrgfe: 0.363566 hartree
zpe.sumelectzpe: -998.029717 hartree
zpe.sumelectthermal: -998.004589 hartree
zpe.sumelectthermalent: -998.003645 hartree
zpe.sumelectthermalfe: -998.094536 hartree
dipole: -2.2040 -2.0465 0.5664
dipole: 3.0605
quadrupole: -153.3375 -115.5472 -137.7946
quadrupole: -9.1174 2.2740 -4.1306
quadrupole: -17.7778 20.0126 -2.2349 -9.1174 2.2740 -4.1306
hfenergy: -998.4581016 hartree
pointgroup: C01 [X(C17H28N2O3)]
dipole: 0.4984897 1.086249 0.1464475 debye
polarizability: 258.0395433|-8.4377085|231.8259804|14.4104553|2.8104119|138.6202544 unknown
InChI: InChI=1S/C17H28N2O3/c1-2-3-4-5-11-21-13-14-22-12-7-10-19-17(20)16-8-6-9-18-15-16/h6,8-9,15,19H,2-5,7,10-14H2,1H3
charge 0 multiplicity 1
50 atoms
O  0.955858 2.505875 -0.800973
O  -2.2738 1.410192 0.853678
O  -5.03548 -2.67155 -0.426335
N  -3.821973 -0.789735 0.193752
N  -0.389961 -3.274125 0.969024
C  4.607978 1.558098 -0.177637
C  5.935325 2.31841 -0.39759
C  3.367769 2.388611 -0.58113
C  7.182325 1.491937 -0.008609
C  2.057319 1.632082 -0.348503
C  -0.368704 1.886179 -0.706895
C  -4.711397 1.467742 0.700254
C  8.504588 2.258401 -0.227989
C  -3.413544 2.205319 0.335908
C  -0.959604 2.062235 0.710173
C  -4.927832 0.146544 -0.066076
C  -3.950029 -2.14189 -0.012975
C  -2.72997 -2.991018 0.270868
C  -2.836803 -4.387494 0.051681
C  -1.483343 -2.490692 0.732193
C  -1.720488 -5.213158 0.293993
C  -0.520729 -4.616542 0.747746
H  4.529501 1.263693 0.889949
H  4.627983 0.613415 -0.760191
H  5.922012 3.259422 0.191074
H  6.013912 2.619674 -1.463035
H  3.429085 2.666854 -1.65096
H  3.341209 3.334181 -0.005506
H  7.195351 0.552949 -0.598959
H  7.101169 1.188644 1.055295
H  2.038197 0.683804 -0.930147
H  1.940909 1.37831 0.727707
H  -0.327808 0.806383 -0.966269
H  -0.991172 2.406252 -1.456301
H  -5.561608 2.141688 0.480512
H  -4.714152 1.27726 1.789847
H  9.380086 1.646327 0.056808
H  8.530085 3.185814 0.374948
H  8.624354 2.546337 -1.289579
H  -3.388102 3.209661 0.807875
H  -3.326552 2.32868 -0.764609
H  -1.039274 3.140673 0.955948
H  -0.314816 1.576147 1.462313
H  -5.009641 0.346762 -1.155698
H  -5.874769 -0.335977 0.235298
H  -2.945585 -0.351012 0.506584
H  -3.795417 -4.780012 -0.303087
H  -1.329509 -1.423495 0.935731
H  -1.770999 -6.294983 0.135795
H  0.371643 -5.221371 0.945399
