program: Gaussian 09
title: 000227716
version: EM64L-G09RevD.01
frameworkgroup: C1[X(C12H13NO2)]
method: RPBEPBE
basis: SDD
operation: Freq
keyword: #p
keyword: freq=noraman
keyword: PBEPBE/SDD
title: #p freq=noraman PBEPBE/SDD
converged: YES YES NO NO
title: Mulliken charges:
elementType: O O N C C C C C C C C C C C C H H H H H H H H H H H H H
charge: -0.208470 -0.206616 -0.156394 -0.259212 -0.266104 -0.245235 -0.242550 -0.532326 -0.219088 -0.218934 0.129476 0.141997 -0.434142 -0.021549 -0.555564 0.286737 0.286781 0.274404 0.274984 0.241430 0.258662 0.247341 0.247343 0.247136 0.237842 0.246536 0.219131 0.226383
chargesum: 0.00000
title: Mulliken charges with hydrogens summed into heavy atoms:
elementType: O O N C C C C C C C C C C C C
charge: -0.208470 -0.206616 -0.156394 0.027525 0.020677 0.029169 0.032434 -0.032234 0.028253 0.028409 0.129476 0.141997 0.050836 0.224987 -0.110050
polarizability: 1.50473261e+02 -7.58564081e+00 1.35167342e+02 5.11359545e+00 -9.99605145e-02 9.96428889e+01
1716.lowfreq: -10.4235 -0.0008 -0.0007 -0.0006 9.0766 11.7775 26.6068 44.3091 81.6771
frequency: 26.1714 44.2459 81.6634 87.4686 140.3871 190.0636 200.7228 250.9402 309.8225 339.9825 381.1299 416.8282 420.9674 495.5480 508.1230 557.1949 608.5140 621.4998 674.3533 694.4345 721.8515 760.6716 786.7944 788.5084 803.8653 876.0061 887.1871 899.3675 901.9157 917.8198 927.7277 936.1142 951.0349 962.5948 999.2087 999.5049 1009.0803 1022.0865 1022.1499 1057.5704 1090.0253 1097.1279 1130.0118 1134.0146 1148.1514 1190.8350 1213.7852 1221.2901 1240.4955 1259.0691 1262.8920 1269.8401 1280.0566 1280.8851 1308.6651 1315.5799 1327.0143 1358.3451 1428.7249 1443.7789 1484.6163 1578.4032 1621.1316 1661.1338 1683.2573 3013.2473 3021.2775 3061.7840 3073.6445 3085.2018 3091.3210 3099.6007 3101.2196 3108.7763 3117.5428 3160.5839 3192.6889 3200.4792
redmass: 3.5078 4.0273 3.0652 4.6900 5.2441 3.8272 4.2121 3.7402 4.9300 4.3103 2.7188 3.6239 2.8317 1.9167 4.0472 2.8810 4.6149 4.6093 4.8538 2.5092 2.0730 4.3700 5.0068 3.4714 4.4762 2.2790 2.1230 2.3453 2.4759 1.8487 1.6407 2.0515 3.0387 1.3309 1.7866 1.8091 1.1597 1.5311 2.1149 5.9859 1.2328 1.1271 2.6056 1.6544 1.7511 2.5389 1.3180 1.2561 1.5728 1.7996 1.3336 1.5531 1.5665 1.2711 2.1614 1.7435 1.8075 1.7044 1.1693 1.1146 1.1015 5.7278 12.3369 4.6424 11.5642 1.0601 1.0620 1.0857 1.0871 1.0977 1.0636 1.1027 1.0890 1.0943 1.0961 1.0876 1.1098 1.1148
irintensity: 0.1709 0.9456 2.0569 0.0658 7.0295 1.8088 0.8940 2.8868 9.1450 7.8885 1.1008 4.1036 4.8839 2.4952 0.1908 2.1306 13.4419 7.5358 3.6247 53.2642 28.7515 17.0181 0.4237 12.4631 0.0025 23.4218 24.9194 4.0706 1.1787 1.0515 2.5430 10.5292 0.5375 81.4762 0.4854 0.5428 17.3733 8.6999 20.1692 5.5378 5.1582 1.7213 61.2466 22.6067 1.0383 45.5421 21.9737 0.8679 0.0820 5.2080 0.6973 2.3953 4.6442 3.9077 111.4236 10.8830 67.9887 68.1008 10.0830 39.5546 10.0949 4.0162 513.6603 5.3466 33.4721 19.2247 27.3783 3.3339 12.8030 0.1705 7.3793 21.5796 26.1397 6.8656 5.1148 4.1833 19.0262 18.7681
temp: 298.150 k
press: 1.00000 atm
elementType: 8 8 7 6 6 6 6 6 6 6 6 6 6 6 6 1 1 1 1 1 1 1 1 1 1 1 1 1
symmnumber: 1
zpe: 589984.0 jmol-1
zpe.correction: 0.224713 hartree
zpe.thermalcorrener: 0.237364 hartree
zpe.thermalcorrenthalpy: 0.238308 hartree
zpe.thermalcorrgfe: 0.184388 hartree
zpe.sumelectzpe: -669.155441 hartree
zpe.sumelectthermal: -669.142791 hartree
zpe.sumelectthermalent: -669.141846 hartree
zpe.sumelectthermalfe: -669.195767 hartree
dipole: -1.8117 -0.1787 0.4487
dipole: 1.8750
quadrupole: -79.3151 -101.1557 -84.5309
quadrupole: -0.5213 3.4301 -1.0835
quadrupole: 9.0188 -12.8218 3.8030 -0.5213 3.4301 -1.0835
hfenergy: -669.3801545 hartree
pointgroup: C01 [X(C12H13N1O2)]
dipole: -0.7125921 0.0944524 -0.1657136 debye
polarizability: 150.6318584|7.7867398|134.7238936|-4.7396557|2.8536632|99.9277405 unknown
InChI: InChI=1S/C12H13NO2/c1-2-5-13-11(14)9-7-3-4-8(6-7)10(9)12(13)15/h2-4,7-10H,1,5-6H2
charge 0 multiplicity 1
28 atoms
O  0.769158 -2.509979 0.274892
O  1.051129 2.092562 1.11695
N  1.207411 -0.226663 0.683082
C  -1.091737 -0.869896 0.632298
C  -0.996791 0.665157 0.911004
C  -1.895744 -0.937873 -0.737993
C  -1.759717 1.304992 -0.328074
C  -1.332722 0.324276 -1.466154
C  -3.310017 -0.447098 -0.394613
C  -3.228611 0.893543 -0.149228
C  0.357514 -1.345953 0.504938
C  0.501638 0.981236 0.926066
C  2.682504 -0.302442 0.582395
C  3.156841 -0.304466 -0.861074
C  3.906426 0.68193 -1.409775
H  -1.599586 -1.450839 1.418498
H  -1.446789 0.989382 1.862956
H  -1.811723 -1.908221 -1.24712
H  -1.55162 2.37531 -0.465068
H  -0.244031 0.294173 -1.651671
H  -1.859945 0.52927 -2.411457
H  -4.183898 -1.094557 -0.285833
H  -4.02294 1.558448 0.199523
H  2.994508 -1.234986 1.08794
H  3.086719 0.567334 1.127566
H  2.866769 -1.181641 -1.45616
H  4.241921 0.632942 -2.451932
H  4.203733 1.566958 -0.833851
