program: Gaussian 09
title: 000227713
version: EM64L-G09RevD.01
frameworkgroup: C1[X(C12H21Cl2O7P)]
method: RPBEPBE
basis: SDD
operation: Freq
keyword: #p
keyword: freq=noraman
keyword: PBEPBE/SDD
title: #p freq=noraman PBEPBE/SDD
converged: YES YES NO NO
title: Mulliken charges:
elementType: Cl Cl P O O O O O O O C C C C C C C C C C C C H H H H H H H H H H H H H H H H H H H H H
charge: -0.062404 -0.068120 1.319438 -0.530303 -0.531381 -0.600283 -0.272542 -0.251616 -0.213721 -0.270576 -0.608201 -0.538144 0.300865 0.296093 -0.182673 -0.179969 -0.227651 -0.565268 -0.581524 -0.266957 -0.680004 -0.656482 0.356447 0.273064 0.309373 0.257110 0.254090 0.264938 0.239762 0.236714 0.230194 0.260151 0.277914 0.269690 0.287455 0.231424 0.227133 0.231193 0.240289 0.219063 0.235170 0.256406 0.213844
chargesum: 0.00000
title: Mulliken charges with hydrogens summed into heavy atoms:
elementType: Cl Cl P O O O O O O O C C C C C C C C C C C C
charge: -0.062404 -0.068120 1.319438 -0.530303 -0.531381 -0.600283 -0.272542 -0.251616 -0.213721 -0.270576 -0.251754 0.044293 0.300865 0.296093 0.328527 0.324731 0.239257 -0.027203 -0.024379 0.191599 0.010541 0.048939
polarizability: 2.51148567e+02 5.53580532e-01 1.93009768e+02 -1.00531927e+01 3.07801237e+00 1.49199454e+02
1716.lowfreq: -10.6517 -9.8167 -0.0029 -0.0025 -0.0017 3.5675 7.5536 10.7573 24.3934
frequency: 5.9241 9.2599 24.1919 25.6744 34.8096 40.8839 47.4830 52.8108 63.7778 72.9478 82.0088 85.8063 89.7405 100.3977 104.5957 119.4397 141.1365 149.5883 167.4060 180.7933 191.3193 196.0356 215.4600 231.2365 237.0372 240.4861 258.5417 267.4340 293.3909 320.1354 348.0288 362.8111 375.5834 398.8614 417.3725 451.6100 527.4840 540.6744 564.7062 601.3623 627.8690 644.0316 657.4292 710.4413 715.4777 749.0427 789.4503 798.7534 803.0068 813.5560 817.8723 858.6770 904.8697 926.5733 937.5634 943.0490 954.9677 993.7905 1005.4735 1014.9238 1019.9838 1036.3601 1081.7030 1085.6560 1089.5840 1096.7232 1110.5246 1118.6598 1135.8982 1150.7267 1156.7089 1164.5654 1171.2148 1174.0220 1218.5109 1236.4931 1251.1000 1253.8770 1259.4000 1261.4761 1274.5828 1296.1078 1343.9901 1356.5489 1361.5434 1362.8710 1365.8735 1395.6992 1406.4532 1428.2469 1430.6669 1458.7283 1460.2048 1462.7699 1467.3290 1468.9413 1474.7022 1483.2022 1486.1381 1486.7477 1621.9401 1633.7896 2995.3683 2996.3515 2999.3992 3011.8364 3022.2325 3025.5661 3033.3478 3058.5596 3061.8440 3070.6069 3070.7227 3075.5102 3090.5808 3091.8240 3091.9340 3097.4501 3098.6382 3107.8263 3123.3211 3146.5072 3164.5394
redmass: 5.6611 7.7198 5.6243 7.3880 7.1453 4.6848 3.3026 3.1804 3.8016 4.9291 2.6645 3.4105 6.1748 4.5758 5.4078 3.1874 5.1074 3.2729 4.7267 5.9345 2.6230 2.1317 3.3971 3.8894 2.8518 5.0112 1.4958 3.4501 4.3570 4.1896 6.0453 3.5509 4.1437 6.0417 3.4061 4.6967 5.3590 3.1495 5.7920 5.2757 6.2173 8.7922 5.1416 5.4430 5.6317 5.8852 2.1750 1.1233 1.1149 2.8942 1.8695 2.3862 3.7119 2.5032 3.2465 4.2887 3.9294 1.8475 2.7302 1.2561 2.3111 11.4872 2.6429 3.6416 3.9272 2.1640 2.2403 2.1692 1.4642 1.1695 1.7118 1.7893 1.4266 1.3635 1.1624 1.3929 1.1367 1.1611 1.3057 1.3711 1.1373 1.1908 1.3589 1.3719 1.2962 1.3139 1.6627 1.2286 1.2482 1.0956 1.1054 1.0985 1.0709 1.0664 1.0431 1.0755 1.0692 1.0546 1.0807 1.0680 9.0823 10.0085 1.0364 1.0362 1.0573 1.0583 1.0642 1.0573 1.0600 1.0677 1.0846 1.1063 1.0964 1.0564 1.0958 1.0984 1.0977 1.1026 1.1101 1.1028 1.1062 1.1097 1.1121
irintensity: 0.5926 0.8265 0.4991 1.0102 0.8871 1.5650 0.3450 1.0143 0.5011 4.2030 1.4553 0.3839 1.2722 4.2173 0.4799 10.8920 6.2467 6.0941 5.8410 4.7033 1.7022 4.1552 15.3251 1.2877 4.8951 4.7853 0.3321 7.8588 15.5644 19.9495 24.0923 13.7655 56.4765 11.1712 0.5635 5.8537 9.8356 3.2810 15.3338 42.4934 5.7564 28.7152 59.7224 53.1353 31.0060 79.3234 15.6662 5.8088 0.7454 7.5462 5.5326 84.6936 29.3909 44.0145 115.1948 128.5162 89.0145 65.2997 59.5131 1.1399 135.5646 85.5370 41.2639 3.1481 12.4175 44.2123 84.8738 171.9664 5.8724 0.2366 5.2567 35.0588 91.2593 92.7412 8.4691 133.4877 0.7444 3.2618 116.7223 151.4846 23.2912 16.6261 3.8799 5.2144 0.0311 9.6415 11.6108 20.3886 22.3971 35.0149 14.1374 6.0576 15.0044 9.4240 13.5587 19.1574 5.5368 15.5921 4.5313 20.8542 274.7693 104.0119 17.2732 14.8277 26.1354 16.6848 5.1184 10.7228 33.0219 11.3300 1.8176 6.4802 13.9609 13.7199 2.6278 31.5912 24.1964 1.9279 5.5410 33.7232 31.4885 8.4206 12.1084
temp: 298.150 k
press: 1.00000 atm
elementType: 17 17 15 8 8 8 8 8 8 8 6 6 6 6 6 6 6 6 6 6 6 6 1 1 1 1 1 1 1 1 1 1 1 1 1 1 1 1 1 1 1 1 1
symmnumber: 1
zpe: 863340.7 jmol-1
zpe.correction: 0.328829 hartree
zpe.thermalcorrener: 0.356927 hartree
zpe.thermalcorrenthalpy: 0.357872 hartree
zpe.thermalcorrgfe: 0.262473 hartree
zpe.sumelectzpe: -2256.027291 hartree
zpe.sumelectthermal: -2255.999193 hartree
zpe.sumelectthermalent: -2255.998249 hartree
zpe.sumelectthermalfe: -2256.093647 hartree
dipole: 2.7757 -1.0968 3.8898
dipole: 4.9028
quadrupole: -138.5062 -152.1635 -154.3835
quadrupole: 16.0928 3.0429 -2.2379
quadrupole: 9.8449 -3.8125 -6.0324 16.0928 3.0429 -2.2379
hfenergy: -2256.35612 hartree
pointgroup: C01 [X(C12H21Cl2O7P1)]
dipole: 0.8934147 -1.0878579 1.3187499 debye
polarizability: 237.7443181|-20.2426837|200.8431255|-17.728677|16.556251|154.7703466 unknown
InChI: InChI=1S/C12H21Cl2O7P/c1-3-18-11(15)9-10(12(16)19-4-2)22(17,20-7-5-13)21-8-6-14/h10H,3-9H2,1-2H3
charge 0 multiplicity 1
43 atoms
Cl 0.833386 4.503949 1.051837
Cl -4.457667 3.110075 0.193473
P  0.319312 0.30511 -0.515124
O  0.699965 1.285488 0.868353
O  -1.253077 0.889043 -0.946139
O  1.357033 0.348055 -1.719634
O  -2.234118 -1.297576 1.000712
O  3.343099 -2.868496 -0.76677
O  -1.804058 -2.739836 -0.783479
O  2.817841 -1.159857 0.730933
C  0.030793 -1.442432 0.239594
C  1.025477 -2.428914 -0.395155
C  -1.40714 -1.90723 0.061753
C  2.464391 -2.061849 -0.070463
C  2.022771 1.947151 0.934371
C  -2.011635 1.833403 -0.077833
C  -3.688872 -1.661242 0.924354
C  1.885481 3.150135 1.84546
C  -3.286309 2.085559 -0.876675
C  4.802938 -2.540856 -0.646458
C  -4.414783 -0.8447 1.98757
C  5.18074 -1.468038 -1.670586
H  0.237249 -1.284645 1.31208
H  0.823631 -3.450824 -0.023333
H  0.90453 -2.47182 -1.490288
H  2.742726 1.225267 1.36607
H  2.363001 2.230425 -0.078483
H  -1.431891 2.7575 0.085304
H  -2.230255 1.35571 0.892867
H  -3.772237 -2.749838 1.093658
H  -4.041614 -1.444316 -0.10013
H  2.867092 3.610462 2.037875
H  1.379565 2.895417 2.787706
H  -3.816702 1.151605 -1.109137
H  -3.103536 2.670411 -1.78803
H  5.003633 -2.209623 0.387493
H  5.300013 -3.503637 -0.843124
H  -4.000749 -1.045519 2.990323
H  -4.343499 0.238164 1.787376
H  -5.485341 -1.119317 1.994553
H  4.951806 -1.804314 -2.695878
H  4.63119 -0.530905 -1.480399
H  6.264617 -1.258346 -1.606395
