program: Gaussian 09
title: 000227709
version: EM64L-G09RevD.01
frameworkgroup: C1[X(C11H10Cl2O3)]
method: RPBEPBE
basis: SDD
operation: Freq
keyword: #p
keyword: freq=noraman
keyword: PBEPBE/SDD
title: #p freq=noraman PBEPBE/SDD
converged: YES YES NO NO
title: Mulliken charges:
elementType: Cl Cl O O O C C C C C C C C C C C H H H H H H H H H H
charge: -0.021168 -0.055404 -0.253039 -0.259765 -0.253135 -0.335038 0.517614 -0.295110 -0.288501 -0.298219 -0.200574 -0.239664 -0.107515 0.249477 -0.194487 -0.471458 0.242117 0.247943 0.233650 0.252014 0.248304 0.281036 0.258677 0.260396 0.233997 0.247853
chargesum: 0.00000
title: Mulliken charges with hydrogens summed into heavy atoms:
elementType: Cl Cl O O O C C C C C C C C C C C
charge: -0.021168 -0.055404 -0.253039 -0.259765 -0.253135 0.155023 0.517614 0.190554 -0.288501 -0.049915 0.080462 0.019012 -0.107515 0.249477 0.065909 0.010393
polarizability: 1.57401958e+02 3.62606750e+00 1.93217525e+02 -2.20526194e+01 5.87821110e+00 8.81060816e+01
1716.lowfreq: -4.4619 0.0010 0.0011 0.0022 3.9120 4.4122 13.8954 28.5177 37.1890
frequency: 13.8483 28.4861 37.1433 62.4092 74.9145 107.7727 130.6375 164.6219 175.0094 195.0934 208.5053 268.5408 301.2050 322.2404 336.9007 368.9236 391.5629 429.3736 436.6250 485.5946 518.0404 531.9439 545.1252 614.8199 639.6950 675.8486 698.1049 777.7954 779.5152 785.1383 799.0401 862.8850 863.2947 896.7185 927.7842 997.9394 998.6613 1004.2691 1026.1709 1039.2628 1063.6131 1085.0962 1098.3393 1129.4269 1151.5074 1218.4620 1245.2995 1253.7458 1276.9609 1290.0579 1355.0093 1359.5278 1367.6769 1388.3185 1411.2730 1429.1247 1461.1448 1476.5152 1570.7013 1593.6229 1618.7951 1639.7057 3018.7572 3031.4117 3092.5522 3105.4014 3121.8845 3161.2089 3163.3038 3180.2197 3182.8053 3221.9988
redmass: 6.8913 6.3058 6.4006 6.0343 5.3041 6.2524 3.9387 5.9027 11.6385 4.8304 3.5175 4.6504 5.6366 5.6906 4.3150 6.1314 6.2911 3.1736 3.2730 2.6324 2.5509 2.6766 4.1887 6.5056 4.1129 6.4279 3.9145 4.3038 4.2635 3.6789 1.4865 1.4569 2.9081 2.8139 1.3410 2.9329 1.4246 1.1112 3.9855 2.9304 1.6539 2.6737 2.3776 4.0150 1.3231 1.7907 1.3801 1.5456 1.1725 1.4355 1.6995 2.2828 1.3435 5.2961 1.2099 1.1058 2.7107 1.0831 7.7669 7.6555 10.2490 4.5085 1.0610 1.0601 1.1061 1.0603 1.1027 1.0879 1.0958 1.0956 1.0945 1.1157
irintensity: 0.2581 0.4017 0.7062 5.0147 0.3221 1.3240 0.8976 0.1646 0.8120 2.6983 5.6474 3.6368 10.0421 4.6142 10.3881 1.0025 1.6758 9.9228 4.3190 2.2811 2.4107 1.9488 6.9206 33.4185 5.4763 27.5615 1.3585 27.7012 52.6216 13.5796 41.2288 23.0283 4.9064 25.0645 0.0570 4.5662 34.0447 60.2483 59.4536 61.3984 19.7439 48.5850 39.6140 271.8362 7.7050 73.5419 17.8062 109.7432 44.5845 28.8488 25.8314 6.7071 1.0803 1.9640 60.3022 26.0871 245.0062 20.6699 22.6081 10.0784 122.1264 19.3222 12.3195 45.5593 11.2370 2.9750 8.5155 3.9679 1.6592 1.2083 1.8287 5.6708
temp: 298.150 k
press: 1.00000 atm
elementType: 17 17 8 8 8 6 6 6 6 6 6 6 6 6 6 6 1 1 1 1 1 1 1 1 1 1
symmnumber: 1
zpe: 486191.8 jmol-1
zpe.correction: 0.185181 hartree
zpe.thermalcorrener: 0.201222 hartree
zpe.thermalcorrenthalpy: 0.202167 hartree
zpe.thermalcorrgfe: 0.138176 hartree
zpe.sumelectzpe: -1569.746620 hartree
zpe.sumelectthermal: -1569.730579 hartree
zpe.sumelectthermalent: -1569.729634 hartree
zpe.sumelectthermalfe: -1569.793625 hartree
dipole: -3.1537 0.5382 -0.1343
dipole: 3.2021
quadrupole: -109.5719 -100.2643 -107.3965
quadrupole: -1.1019 2.4891 -3.7305
quadrupole: -3.8277 5.4799 -1.6522 -1.1019 2.4891 -3.7305
hfenergy: -1569.931801 hartree
pointgroup: C01 [X(C11H10Cl2O3)]
dipole: -1.2372297 0.0670671 0.2277208 debye
dipolederiv: -0.1289087 0.0394585 0.1924535 0.0185561 -0.0902829 -0.1437506 0.1613536 -0.1721459 -0.6528135 -0.4193719 -0.2523558 -0.2431295 -0.2821322 -0.2806405 -0.2361425 -0.2559281 -0.2236045 -0.3501006 -1.3081616 -0.4319134 -0.3602108 -0.7185297 -0.6318779 -0.2468723 -0.5787062 -0.2749016 -0.4072869 -0.621976 0.1215617 0.3184458 0.231178 -0.5913768 -0.2498094 0.491483 -0.335449 -1.140523 -0.4964648 -0.079057 0.1591807 -0.0820491 -0.813601 0.1145168 0.195018 0.0302489 -0.576766 1.001083 0.2653785 0.0733906 0.2886569 0.2993095 0.0004671 -0.0610894 -0.0564604 0.1029531 0.7532644 0.3927284 0.4242285 0.6746342 0.457583 0.2180424 0.9059938 0.338907 0.1291357 0.2254812 -0.0836332 -0.0152774 -0.1898762 0.4434233 0.2892058 -0.0891514 0.2362439 0.4494202 -0.0311025 -0.1125788 -0.4325857 -0.088994 -0.0452444 0.1925761 -0.3089132 0.2847481 0.9451519 -0.0925626 0.0315107 0.0585738 -0.0718866 -0.1811487 0.0685403 -0.3235932 -0.0735232 -0.0550973 -0.1294592 -0.0397883 -0.0257679 -0.0539163 -0.1131542 -0.0840647 -0.0317456 -0.1016265 -0.2337505 -0.0559712 -0.0346661 -0.175767 0.0154074 -0.1292869 -0.0807722 -0.0413621 -0.0260981 -0.0837038 0.4703781 0.4170103 0.3888195 0.4290459 0.2630912 0.3840408 0.3711823 0.3592472 0.3744123 0.6404716 -0.0222293 -0.489338 -0.1078937 1.1012729 0.2238307 -0.7138935 0.2961456 1.3550069 -0.1835516 0.1562685 0.0292952 0.1296491 -0.2110453 -0.2327768 0.0647906 -0.3098369 -0.2704961 -0.2055783 0.012919 -0.1372808 0.087726 0.0696092 -0.0271708 -0.1525708 0.1037039 0.0404113 -0.0383435 -0.0147004 0.0133187 -0.0541321 -0.0756876 -0.1010358 -0.0336978 -0.117546 0.0610601 -0.0130603 -0.0364646 -0.0416247 -0.0196537 0.1159898 0.0072523 0.0278825 0.080269 -0.07274 -0.1047777 -0.0889386 -0.0311276 -0.000253 -0.0038761 -0.0707956 0.0627681 0.0054247 0.0861781 0.1227841 0.0260173 0.0524988 0.053666 0.036097 0.0170203 0.0122558 -0.000193 -0.0718585 -0.0073847 -0.0831058 0.0456169 -0.0879714 0.1149012 -0.007873 0.0805363 -0.0191237 0.0586401 0.0448286 -0.0453465 0.0398413 -0.0480611 0.1432494 -0.0065072 0.0380888 -0.0070856 0.0991908 0.1039948 -0.0153339 0.0429586 -0.0215012 0.1336183 -0.0537249 0.0348473 -0.048117 -0.0117909 0.1576088 -0.0665854 0.0465591 -0.0409253 0.0100915 0.0184636 0.0645694 0.0528845 0.0512106 0.1561244 -0.0098263 0.0215113 0.0035318 -0.045953 -0.063513 0.0375052 -0.0605273 0.0859852 0.1606557 -0.0463294 0.0454171 -0.0642758 0.0249391 0.0708524 0.0423765 0.0384162 0.0881707 unknown
polarizability: 152.4608368|26.2154663|118.6325466|-11.891658|43.9502504|167.6321811 unknown
InChI: InChI=1S/C11H10Cl2O3/c1-2-11(14)16-6-5-15-10-4-3-8(12)7-9(10)13/h2-4,7H,1,5-6H2
charge 0 multiplicity 1
26 atoms
Cl 2.829548 -0.853539 -2.837321
Cl 4.020933 1.638816 1.979382
O  0.317604 -1.620438 -1.504596
O  -2.184661 0.085501 -0.851356
O  -3.147072 -0.962826 1.004418
C  -0.99655 -2.13173 -1.079957
C  1.100278 -0.860348 -0.634301
C  -2.138576 -1.226014 -1.548197
C  2.355187 -0.425035 -1.141052
C  0.759527 -0.512317 0.696959
C  3.246439 0.332003 -0.361143
C  1.644073 0.243454 1.497355
C  2.874448 0.656786 0.958298
C  -2.745162 0.084506 0.436086
C  -2.773257 1.466316 0.975055
C  -3.301591 1.732425 2.198082
H  -1.093267 -3.097381 -1.60726
H  -1.040363 -2.32304 0.005387
H  -3.099819 -1.752059 -1.396064
H  -2.004483 -0.956315 -2.606775
H  -0.196018 -0.820742 1.128408
H  4.204228 0.654853 -0.776347
H  1.368802 0.505647 2.522433
H  -2.349808 2.246002 0.334167
H  -3.327579 2.750534 2.599572
H  -3.719362 0.925539 2.811772
