program: Gaussian 09
title: 000227698
version: EM64L-G09RevD.01
frameworkgroup: C1[X(C14H19NO)]
method: RPBEPBE
basis: SDD
operation: Freq
keyword: #p
keyword: freq=noraman
keyword: PBEPBE/SDD
title: #p freq=noraman PBEPBE/SDD
converged: YES YES NO NO
title: Mulliken charges:
elementType: O N C C C C C C C C C C C C C C H H H H H H H H H H H H H H H H H H H
charge: -0.281876 -0.229970 0.423268 0.355335 0.343017 -0.595276 -0.349168 -0.433318 -0.819312 0.167574 -0.815724 -0.696717 -0.447138 0.426566 -0.789457 -0.778743 0.242225 0.303426 0.227729 0.226090 0.225964 0.224612 0.223341 0.222213 0.230801 0.266730 0.227212 0.256607 0.241456 0.229348 0.229274 0.227833 0.281077 0.232922 0.202082
chargesum: 0.00000
title: Mulliken charges with hydrogens summed into heavy atoms:
elementType: O N C C C C C C C C C C C C C C
charge: -0.281876 -0.229970 0.423268 0.355335 0.343017 -0.353051 -0.045742 -0.205589 -0.142646 0.167574 -0.139369 0.053832 -0.205682 0.426566 -0.103003 -0.062663
polarizability: 2.84169040e+02 5.33102189e+00 1.61545716e+02 -1.44631976e+00 -2.33820098e+00 9.16397240e+01
1716.lowfreq: -2.8270 -0.0008 -0.0007 0.0008 4.0018 9.9879 21.5842 32.5185 50.6483
frequency: 21.0697 32.4640 50.2840 71.8334 88.7899 111.9406 120.4637 152.3771 165.7967 192.9725 198.2230 208.3015 219.7046 249.4689 270.0002 294.5598 325.9201 362.3413 381.5929 383.8575 420.9372 446.0541 460.9249 481.9773 519.6148 563.2190 585.3524 629.3074 693.2632 712.5233 723.0375 748.4741 833.0327 835.9676 864.8794 869.3216 875.8518 939.7403 956.1898 964.3439 986.3491 994.1691 1004.3059 1029.1863 1052.5851 1054.5149 1084.3419 1097.9515 1110.5985 1118.8635 1133.2641 1185.5087 1199.3879 1228.6530 1256.0547 1295.1274 1308.2536 1368.3580 1374.0857 1392.0174 1394.1959 1400.1838 1405.0814 1415.0268 1439.5262 1443.0303 1455.0507 1462.5141 1467.5422 1469.0312 1471.0936 1475.0561 1478.6024 1490.8968 1492.1888 1502.0680 1551.9928 1578.3284 1623.3183 1656.4815 2964.1113 2964.6315 2967.6822 2968.0136 2972.9017 3034.6429 3037.7968 3041.0354 3043.2099 3067.5379 3078.4699 3081.9291 3084.6154 3107.2330 3117.5461 3122.7162 3126.8535 3140.6771 3215.5057
redmass: 3.1432 3.9786 1.6688 3.1121 2.0980 1.3096 1.6700 1.0964 1.4178 2.6942 2.2372 2.4602 2.3529 1.8106 3.2742 2.6547 3.9422 3.1327 4.0526 3.2746 2.5674 2.8096 3.3224 2.5089 3.8901 4.9657 3.5479 4.8815 3.5800 4.4605 2.9868 4.2459 2.9454 1.5005 1.5391 1.4813 4.2491 2.2688 1.4875 1.3485 1.2605 1.5959 1.5097 1.4401 1.6296 1.6419 1.7323 2.1049 1.4028 1.9143 2.1171 1.7118 2.4573 2.2781 3.9690 1.4950 3.3979 3.7462 1.8159 1.3482 1.2415 1.2523 1.3240 2.5472 1.1690 1.1009 1.0557 1.0467 1.0988 1.0580 1.1608 1.0487 1.1597 1.0883 1.0499 2.4854 6.7520 7.0784 6.3684 6.0797 1.0373 1.0380 1.0379 1.0428 1.0398 1.0970 1.0964 1.0969 1.0955 1.0926 1.0985 1.0975 1.0992 1.0934 1.0952 1.0908 1.0966 1.0901 1.0936
irintensity: 0.4628 3.9154 0.7631 1.0515 0.4327 0.1231 0.9910 1.5204 1.3180 1.8260 1.9370 0.4079 1.0758 1.7639 0.7867 0.7155 7.7108 2.7712 3.6516 1.0901 1.2353 6.3226 0.5796 4.6415 1.0958 3.0922 3.7725 11.9727 5.5322 0.9087 3.8533 0.5462 6.2887 25.6662 27.3394 14.1205 8.3514 4.8745 0.0929 3.6748 8.8125 6.9276 27.8448 15.0116 0.6598 150.6686 17.9009 34.9637 0.1067 96.5959 16.1951 15.6066 13.9450 5.9255 41.5991 35.4849 209.9230 5.5079 47.7118 38.1186 5.0866 20.2324 4.6496 62.8706 8.4712 14.7847 16.0074 0.3044 27.8592 38.3078 27.0768 30.4805 1.6392 59.7727 38.4772 132.2890 114.9646 32.2417 48.6320 157.3537 34.8151 58.2228 22.6929 61.7857 47.2661 37.7611 6.0242 9.8202 39.8633 26.1529 35.7778 8.7802 25.4563 13.0720 22.5301 25.6534 5.4197 12.1917 6.6313
temp: 298.150 k
press: 1.00000 atm
elementType: 8 7 6 6 6 6 6 6 6 6 6 6 6 6 6 6 1 1 1 1 1 1 1 1 1 1 1 1 1 1 1 1 1 1 1
symmnumber: 1
zpe: 772236.5 jmol-1
zpe.correction: 0.294129 hartree
zpe.thermalcorrener: 0.311923 hartree
zpe.thermalcorrenthalpy: 0.312867 hartree
zpe.thermalcorrgfe: 0.247472 hartree
zpe.sumelectzpe: -673.663014 hartree
zpe.sumelectthermal: -673.645220 hartree
zpe.sumelectthermalent: -673.644276 hartree
zpe.sumelectthermalfe: -673.709671 hartree
dipole: -0.7033 3.4841 0.7280
dipole: 3.6282
quadrupole: -75.2782 -92.0238 -100.0964
quadrupole: -3.7685 -1.2673 -0.9691
quadrupole: 13.8546 -2.8910 -10.9636 -3.7685 -1.2673 -0.9691
hfenergy: -673.9571433 hartree
pointgroup: C01 [X(C14H19N1O1)]
dipole: -0.3496702 0.926212 1.0283203 debye
polarizability: 283.2887676|6.0879603|139.2930698|10.4742848|33.1471414|114.7726429 unknown
InChI: InChI=1S/C14H19NO/c1-10(2)8-14(16)15(5)13-7-6-11(3)12(4)9-13/h6-9H,1-5H3
charge 0 multiplicity 1
35 atoms
O  -1.53874 -0.868226 -1.330075
N  -0.610344 0.502966 0.350342
C  0.773026 0.210929 0.058587
C  3.153369 0.873394 0.307973
C  3.563663 -0.280596 -0.42374
C  1.77718 1.100918 0.534944
C  1.185742 -0.934857 -0.673801
C  2.559861 -1.155651 -0.901136
C  4.180445 1.861521 0.834552
C  -1.689063 0.037914 -0.444792
C  5.031582 -0.56373 -0.687533
C  -0.883449 1.340567 1.542391
C  -3.002164 0.711564 -0.217294
C  -4.22941 0.18041 -0.521075
C  -5.483561 1.012645 -0.32289
C  -4.462998 -1.217659 -1.053592
H  1.493227 2.009642 1.075702
H  0.437677 -1.622391 -1.065443
H  2.858328 -2.04679 -1.466958
H  4.792142 2.286163 0.015211
H  3.699023 2.700817 1.365245
H  4.886227 1.377947 1.537578
H  5.512006 0.257211 -1.254936
H  5.604531 -0.675267 0.253889
H  5.157834 -1.492492 -1.269552
H  -1.88066 1.104647 1.941847
H  -0.83305 2.426168 1.326187
H  -0.142989 1.104679 2.324359
H  -2.977363 1.741046 0.162003
H  -5.259234 2.038634 0.01541
H  -6.059245 1.075653 -1.26743
H  -6.154634 0.538802 0.420509
H  -3.576535 -1.858877 -0.951502
H  -4.699953 -1.170358 -2.135321
H  -5.335573 -1.67874 -0.551856
