program: Gaussian 09
title: 000227690
version: EM64L-G09RevD.01
frameworkgroup: C1[X(C17H15N3S4)]
method: RPBEPBE
basis: SDD
operation: Freq
keyword: #p
keyword: freq=noraman
keyword: PBEPBE/SDD
title: #p freq=noraman PBEPBE/SDD
converged: YES YES NO NO
title: Mulliken charges:
elementType: S S S S N N N C C C C C C C C C C C C C C C C C H H H H H H H H H H H H H H H
charge: 0.462475 0.452614 0.256742 0.310405 -0.801913 0.066514 0.064974 0.089100 -0.657984 -0.669362 -0.511255 -0.513166 -0.350808 -0.353138 0.367608 0.366816 -0.276541 -0.273595 -0.302223 -0.337694 -0.239879 -0.240393 -0.227332 -0.215441 0.232873 0.210301 0.219405 0.228110 0.273628 0.208666 0.210062 0.246402 0.249537 0.264274 0.259621 0.230695 0.232895 0.232483 0.234522
chargesum: 0.00000
title: Mulliken charges with hydrogens summed into heavy atoms:
elementType: S S S S N N N C C C C C C C C C C C C C C C C C
charge: 0.462475 0.452614 0.256742 0.310405 -0.801913 0.066514 0.064974 0.321973 -0.000168 0.022994 -0.511255 -0.513166 -0.350808 -0.353138 0.367608 0.366816 -0.030139 -0.024058 -0.037949 -0.078073 -0.009183 -0.007498 0.005151 0.019081
polarizability: 3.67475627e+02 2.64793631e+01 2.67310618e+02 2.46782454e+01 -1.28320819e+01 1.98585445e+02
1716.lowfreq: -2.6068 -0.0019 -0.0017 -0.0009 3.5370 6.1822 13.8932 19.0419 32.5221
frequency: 13.4208 18.8419 32.5166 39.0388 50.6225 55.7862 58.7673 104.7186 114.8282 146.5297 162.0446 184.3810 192.5958 198.3387 212.4848 227.1969 255.0359 276.4532 288.9328 293.2960 334.0210 346.2093 351.9829 373.2084 380.7042 406.6613 429.5725 430.9340 456.9716 481.2060 486.8467 506.2636 512.7876 540.0898 564.9354 575.0810 579.9275 592.8911 597.6780 605.3175 676.0705 678.7627 730.2680 731.5662 732.9490 764.3176 768.3084 822.4649 826.2694 847.8980 861.0544 865.9354 867.1057 875.7468 918.5012 931.8751 946.3817 949.1639 973.6405 984.4405 986.4660 1014.8220 1018.5363 1036.2466 1041.8144 1118.2503 1118.9331 1120.0022 1138.7297 1167.8853 1169.1349 1181.1841 1216.7056 1223.7993 1272.8199 1273.6574 1296.8076 1325.8219 1373.1122 1373.9716 1374.6806 1391.4977 1424.2627 1431.1912 1441.9799 1443.0362 1457.1788 1458.5516 1465.6572 1472.9351 1481.2811 1488.6905 1561.4323 1567.7133 1600.7800 1601.8116 2980.7680 2986.0682 3025.2874 3072.5908 3082.8461 3093.8789 3118.1042 3136.5167 3137.0936 3151.4850 3151.6817 3165.5321 3166.9133 3175.9648 3178.5896
redmass: 7.4702 6.5322 5.9139 5.9351 5.5362 3.0196 5.0676 6.6376 6.2665 5.9964 6.2971 5.7580 6.2234 6.4420 1.3573 2.5160 1.1580 5.0771 6.8970 5.4871 10.2069 10.9790 4.3320 6.7992 8.0902 4.3166 3.1583 3.1813 3.7954 9.0817 8.8305 6.4349 5.7159 4.6259 8.3867 6.5655 5.2544 5.9692 9.7413 9.3972 7.1054 7.1287 2.7741 6.2954 2.7794 1.5057 1.5421 7.1021 6.8474 3.2324 1.4008 1.3822 8.6798 9.4923 1.1880 1.4114 1.3801 1.3801 3.1321 1.3181 1.3177 2.1902 2.3527 4.8927 5.5869 1.8719 1.5655 1.6139 2.1257 1.1372 1.1372 2.0917 2.7641 2.7522 1.6065 1.5381 1.4761 1.1742 3.6143 1.3261 4.8252 1.2159 3.0293 2.8085 2.5457 2.5580 1.5437 2.0279 1.1576 1.0897 1.2356 3.6728 6.1237 6.2441 7.0223 7.1171 1.0353 1.0368 1.0854 1.0994 1.0985 1.1006 1.0995 1.0857 1.0858 1.0903 1.0908 1.0957 1.0962 1.0998 1.0983
irintensity: 0.1576 0.1925 0.1389 0.5323 0.3425 0.1270 0.5948 0.8799 1.3437 2.9265 3.5853 1.0486 3.0730 5.6635 0.9096 1.8114 0.1818 2.5564 0.0706 0.9411 0.2998 2.8377 3.3654 0.4087 7.5482 9.4241 4.8653 8.6323 2.1391 0.9351 0.4841 1.5724 8.0513 8.2620 10.7006 2.3130 1.3630 1.2152 19.5966 32.1268 3.2790 3.7001 11.2191 3.0625 23.2836 71.3885 75.4386 8.8227 1.9358 5.6173 1.6466 4.3010 85.4238 58.0581 3.8491 0.5336 1.1922 3.0569 20.2306 0.0790 0.0818 6.3511 8.4000 6.1550 7.0867 73.4566 0.6677 6.6108 13.9818 0.5074 0.4713 36.6898 3.8255 4.3413 0.4263 1.1226 3.1576 19.2674 12.8487 27.1251 11.3151 30.6064 42.5358 25.0514 15.8989 5.3404 8.9613 16.0603 4.3790 31.7705 28.8114 69.0081 2.1326 0.9897 2.7978 7.5198 20.3637 29.5894 2.7825 3.1572 60.0477 27.5066 11.9581 2.2621 1.8901 4.9903 12.7250 13.0201 17.0288 14.4715 13.3653
temp: 298.150 k
press: 1.00000 atm
elementType: 16 16 16 16 7 7 7 6 6 6 6 6 6 6 6 6 6 6 6 6 6 6 6 6 1 1 1 1 1 1 1 1 1 1 1 1 1 1 1
symmnumber: 1
zpe: 735622.9 jmol-1
zpe.correction: 0.280184 hartree
zpe.thermalcorrener: 0.303263 hartree
zpe.thermalcorrenthalpy: 0.304207 hartree
zpe.thermalcorrgfe: 0.224771 hartree
zpe.sumelectzpe: -2411.562799 hartree
zpe.sumelectthermal: -2411.539721 hartree
zpe.sumelectthermalent: -2411.538776 hartree
zpe.sumelectthermalfe: -2411.618212 hartree
dipole: 2.6414 1.0655 1.5486
dipole: 3.2420
quadrupole: -149.4202 -163.1819 -167.1227
quadrupole: 4.4610 -0.9363 -3.4998
quadrupole: 10.4880 -3.2736 -7.2144 4.4610 -0.9363 -3.4998
hfenergy: -2411.8429834 hartree
pointgroup: C01 [X(C17H15N3S4)]
dipole: 0.0736026 -1.0009474 0.7871368 debye
polarizability: 262.272318|4.1246023|362.5625567|-18.5119823|-47.0837554|208.5368155 unknown
InChI: InChI=1S/C17H15N3S4/c1-11(2)20(23-16-18-12-7-3-5-9-14(12)21-16)24-17-19-13-8-4-6-10-15(13)22-17/h3-11H,1-2H3
charge 0 multiplicity 1
39 atoms
S  1.106773 3.093884 -1.541523
S  -1.83039 2.475641 -2.175452
S  3.483454 1.101731 -1.0253
S  -1.951984 -0.683695 -2.454798
N  -0.606705 3.234539 -1.124585
N  0.914011 0.498546 -0.413236
N  -2.512688 0.635934 -0.167584
C  -1.008895 3.828622 0.203418
C  -0.662459 5.331984 0.226624
C  -0.410343 3.071141 1.404402
C  1.650953 1.459658 -0.899607
C  -2.145817 0.840499 -1.410488
C  3.087502 -0.528224 -0.323068
C  -2.441999 -1.622144 -0.988317
C  1.680386 -0.638894 -0.067088
C  -2.668698 -0.733558 0.118709
C  3.974433 -1.58323 -0.037069
C  -2.594223 -3.016936 -0.852332
C  1.161256 -1.831554 0.488269
C  -3.040371 -1.262236 1.379072
C  3.438145 -2.768354 0.517419
C  -2.962653 -3.525239 0.413253
C  2.046951 -2.889027 0.777037
C  -3.182489 -2.655946 1.518119
H  -2.107552 3.70324 0.217815
H  -1.02098 5.787628 1.168288
H  0.431588 5.479695 0.17077
H  -1.132136 5.857176 -0.622847
H  -0.663531 2.001052 1.352173
H  -0.814149 3.493271 2.343168
H  0.689843 3.179417 1.429742
H  5.047226 -1.497481 -0.234089
H  -2.425766 -3.693321 -1.695585
H  0.088037 -1.912661 0.682946
H  -3.211541 -0.578096 2.215335
H  4.109289 -3.602483 0.748516
H  -3.080716 -4.606487 0.542588
H  1.656382 -3.817267 1.207282
H  -3.469044 -3.077722 2.487221
