program: Gaussian 09
title: 000021591
version: EM64L-G09RevD.01
frameworkgroup: C1[X(C21H25NO2)]
method: RPBEPBE
basis: SDD
operation: Freq
keyword: #p
keyword: freq=noraman
keyword: PBEPBE/SDD
title: #p freq=noraman PBEPBE/SDD
converged: YES YES NO NO
title: Mulliken charges:
elementType: O O N C C C C C C C C C C C C C C C C C C C C C H H H H H H H H H H H H H H H H H H H H H H H H H
charge: -0.287522 -0.240837 -0.109402 -0.381651 -0.327105 -0.324460 -0.265855 -0.670250 -0.670587 0.334727 0.279654 0.279431 -0.512417 0.212205 -0.383148 -0.380517 -0.364486 -0.402697 -0.234823 -0.226893 -0.235327 -0.231757 -0.240414 -0.240866 0.218323 0.209060 0.208579 0.189995 0.205116 0.188201 0.236360 0.225893 0.206919 0.229730 0.206847 0.209671 0.228425 0.206396 0.256848 0.254269 0.261879 0.252914 0.252510 0.227729 0.230097 0.228996 0.229217 0.228891 0.232130
chargesum: 0.00000
title: Mulliken charges with hydrogens summed into heavy atoms:
elementType: O O N C C C C C C C C C C C C C C C C C C C C C
charge: -0.287522 -0.240837 -0.109402 0.045732 0.071469 0.068857 0.196399 -0.026753 -0.026095 0.334727 0.279654 0.279431 -0.255569 0.212205 -0.128879 -0.118638 -0.111572 -0.150188 -0.007093 0.003203 -0.006331 -0.002539 -0.011524 -0.008736
polarizability: 3.35636701e+02 -6.18989062e+00 2.77517355e+02 -8.83922285e+00 1.41315009e+01 1.70572079e+02
1716.lowfreq: -7.3809 -1.5676 0.0002 0.0006 0.0008 3.3336 16.1990 20.5736 25.4339
frequency: 14.6510 20.4970 25.4324 37.1607 43.6407 61.9600 65.8228 70.7582 77.5461 83.5030 87.1992 125.4781 150.7693 162.7299 184.4902 214.6903 217.9514 229.4440 258.1386 273.4710 279.4858 289.5716 302.1325 314.0038 361.6528 403.1270 409.2696 414.1713 448.0228 450.8864 477.1491 500.9050 573.4172 611.1661 614.8820 620.8512 653.2588 689.3046 699.3783 700.0250 702.7590 729.5136 750.5283 775.0616 781.3934 789.4930 795.9889 800.5931 848.1305 853.7699 858.8997 890.0035 913.5268 922.9025 931.1641 945.2211 974.0835 974.7294 981.5920 988.6517 990.2045 993.1181 994.6715 998.4881 1027.2347 1031.2323 1061.1682 1063.3401 1075.9632 1083.2070 1084.8722 1086.7645 1092.8928 1096.6088 1123.1834 1161.7045 1164.6771 1173.5298 1174.2469 1194.1383 1196.6228 1207.8119 1229.8237 1264.9233 1275.8702 1286.1047 1292.7810 1315.0920 1321.8383 1324.6799 1361.9887 1363.8402 1367.0195 1377.1117 1381.5176 1386.8557 1387.9869 1390.1893 1432.4044 1434.7967 1460.6099 1463.1366 1471.3073 1471.5389 1477.9305 1479.0935 1485.6444 1486.0695 1487.2009 1490.2709 1577.4214 1579.8811 1598.2798 1607.9517 1609.1091 1614.9464 2853.1550 2861.8997 2906.1705 2982.3708 2983.3113 3011.8583 3026.6577 3033.7647 3052.1495 3074.2204 3076.1459 3084.0320 3091.9451 3092.7681 3124.8550 3125.9876 3133.2739 3134.9070 3144.6635 3147.4416 3149.3921 3154.6092 3160.1571 3167.5099 3175.3071
redmass: 3.8063 4.1890 4.7380 5.7037 3.9962 3.9150 3.5582 4.2540 3.2530 2.8560 2.2680 3.6237 3.2346 2.6549 1.7234 1.4792 4.1144 2.4295 3.6130 3.5594 3.1349 2.6713 4.6933 2.8158 3.5188 2.8348 2.8616 3.3916 2.9760 3.7037 2.9483 3.4338 6.3954 6.0013 6.1357 5.5296 4.6792 4.0295 1.5922 6.1823 1.7305 4.1107 2.8147 2.1097 2.2078 1.1632 1.1422 1.2515 1.2497 1.5184 2.9638 1.5110 1.9486 1.6323 1.4963 4.3323 1.8682 2.2122 1.5715 4.9064 5.3376 2.3327 1.3674 1.3752 2.3857 2.0429 2.3695 1.8837 1.9149 2.0658 2.2113 1.6194 2.7774 2.7347 1.7246 2.3833 1.4447 1.0538 1.0572 1.1248 1.1186 2.2445 1.6592 2.8809 1.1120 1.2101 1.2436 1.3884 1.3339 1.3569 1.3484 1.9620 1.4793 6.5202 2.7319 1.2446 1.2930 1.5582 2.2781 2.2770 1.0578 1.0533 1.0690 1.0575 2.1729 1.0568 2.2424 1.0986 1.0736 1.0771 5.7952 5.7654 7.5841 6.2395 6.4094 9.3346 1.0721 1.0714 1.0706 1.0357 1.0358 1.0577 1.0873 1.0876 1.0904 1.0990 1.0981 1.1069 1.1004 1.1003 1.0848 1.0847 1.0878 1.0885 1.0921 1.0937 1.0892 1.0958 1.0980 1.1014 1.0982
irintensity: 0.3639 0.2334 0.1817 0.9375 0.3212 0.1081 0.2510 0.3630 0.4440 0.0529 0.0764 0.7558 0.6438 0.5124 1.1921 0.9427 0.1020 2.7241 2.3383 0.7700 7.9607 6.2261 3.9551 4.9015 1.1610 0.1791 1.1896 15.5103 12.7520 6.7565 4.2981 4.4203 14.4424 0.3718 1.7429 5.6398 6.7676 2.3866 69.4613 8.5298 32.5466 4.9718 4.8297 47.8000 50.1171 3.4068 4.5783 5.1188 2.5686 8.7349 8.6537 22.3940 0.7102 5.1114 9.3909 37.1886 33.1176 58.4826 4.8921 4.4510 1.5391 25.3954 0.3775 9.6351 2.3539 9.5835 107.2825 37.8603 59.5212 159.1890 3.0882 8.5629 257.6736 242.2042 9.5343 8.7373 4.2606 0.1049 0.2312 6.0177 0.4785 35.7425 17.5418 72.7185 1.0158 12.6021 26.4612 3.3794 2.2858 0.7187 2.4017 20.7576 16.0869 1.2283 26.4590 20.2691 37.2415 1.9760 10.3958 8.8666 2.6507 7.7960 3.3127 3.1703 14.1383 5.6047 5.8730 11.0197 14.9917 8.5194 61.0034 4.1401 185.0024 37.8552 33.5763 150.2631 34.2961 170.1701 83.7785 33.8096 31.1810 21.0041 15.8404 20.9521 10.5420 30.2742 89.8756 44.9571 32.2513 48.5409 0.4647 1.8048 1.3947 5.0140 22.2236 29.5145 0.4735 28.9187 34.3234 25.8690 8.3131
temp: 298.150 k
press: 1.00000 atm
elementType: 8 8 7 6 6 6 6 6 6 6 6 6 6 6 6 6 6 6 6 6 6 6 6 6 1 1 1 1 1 1 1 1 1 1 1 1 1 1 1 1 1 1 1 1 1 1 1 1 1
symmnumber: 1
zpe: 1069494.1 jmol-1
zpe.correction: 0.407349 hartree
zpe.thermalcorrener: 0.431547 hartree
zpe.thermalcorrenthalpy: 0.432491 hartree
zpe.thermalcorrgfe: 0.349376 hartree
zpe.sumelectzpe: -1018.639612 hartree
zpe.sumelectthermal: -1018.615414 hartree
zpe.sumelectthermalent: -1018.614470 hartree
zpe.sumelectthermalfe: -1018.697585 hartree
dipole: 0.6544 -2.0488 -0.4353
dipole: 2.1944
quadrupole: -117.8187 -135.1730 -140.7665
quadrupole: 2.9135 1.1493 4.0884
quadrupole: 13.4341 -3.9203 -9.5138 2.9135 1.1493 4.0884
hfenergy: -1019.0469609 hartree
pointgroup: C01 [X(C21H25N1O2)]
dipole: -0.3335114 -0.7295567 0.3191319 debye
polarizability: 336.2843247|-1.4502816|267.814357|-10.0589977|-32.486389|179.6274526 unknown
InChI: InChI=1S/C21H25NO2/c1-3-22(4-2)15-16-24-21(23)17-20(18-11-7-5-8-12-18)19-13-9-6-10-14-19/h5-14,17H,3-4,15-16H2,1-2H3
charge 0 multiplicity 1
49 atoms
O  1.769223 -0.686578 -0.146919
O  0.929994 1.472552 -0.443553
N  5.498747 -0.759354 0.185934
C  4.1000 -1.254941 0.177514
C  5.876473 -0.124018 1.47828
C  6.487485 -1.763387 -0.288016
C  3.144299 -0.122361 -0.21752
C  6.987007 0.933026 1.326999
C  6.44624 -1.970395 -1.814091
C  -1.850193 -0.000428 -0.165888
C  -2.233894 1.418461 -0.43587
C  -2.961723 -0.959498 0.134226
C  -0.560528 -0.493914 -0.183282
C  0.711991 0.244514 -0.285557
C  -3.192118 2.059701 0.39915
C  -4.223104 -0.832354 -0.513804
C  -1.69581 2.143583 -1.532571
C  -2.783633 -2.028732 1.057979
C  -3.582049 3.394234 0.159368
C  -5.259641 -1.757293 -0.267294
C  -2.102698 3.469553 -1.785684
C  -3.823074 -2.947627 1.311019
C  -3.041314 4.103631 -0.938185
C  -5.065036 -2.819948 0.64544
H  4.002748 -2.070711 -0.559982
H  3.788799 -1.674674 1.16314
H  4.975317 0.369833 1.887419
H  6.182976 -0.892101 2.233243
H  7.493476 -1.398469 -0.011998
H  6.354132 -2.74633 0.231878
H  3.344797 0.227271 -1.245645
H  3.215012 0.747412 0.460367
H  7.923457 0.494349 0.937395
H  6.665091 1.723007 0.626663
H  7.216154 1.395718 2.305217
H  5.464351 -2.348473 -2.152817
H  6.638918 -1.014396 -2.331197
H  7.212315 -2.704956 -2.125796
H  -0.416622 -1.572363 -0.060209
H  -3.618976 1.511899 1.246592
H  -4.380364 -0.014921 -1.225258
H  -0.961967 1.665785 -2.187083
H  -1.836934 -2.117812 1.602369
H  -4.307428 3.877065 0.823506
H  -6.217678 -1.649967 -0.787871
H  -1.681282 4.010932 -2.639655
H  -3.669489 -3.756209 2.034311
H  -3.348553 5.137573 -1.132034
H  -5.872392 -3.534089 0.84217
