program: Gaussian 09
title: 000004346
version: EM64L-G09RevD.01
frameworkgroup: C1[X(C21H27NO6S)]
method: RPBEPBE
basis: SDD
operation: Freq
keyword: #p
keyword: freq=noraman
keyword: PBEPBE/SDD
title: #p freq=noraman PBEPBE/SDD
converged: NO YES NO NO
title: Mulliken charges:
elementType: S O O O O O O N C C C C C C C C C C C C C C C C C C C C C H H H H H H H H H H H H H H H H H H H H H H H H H H H
charge: 0.963481 -0.273708 -0.281503 -0.533756 -0.535137 -0.272208 -0.263615 -0.325253 -0.428924 -0.577017 0.100398 0.587260 -0.043725 -0.547647 -0.370202 0.194338 -0.231308 -0.251017 0.162381 -0.334291 -0.372372 -0.374480 -0.242595 -0.214619 0.449042 -0.204583 -0.672639 -0.687152 -0.798588 0.236408 0.259172 0.246693 0.251322 0.193381 0.260428 0.291740 0.276716 0.287065 0.250907 0.194560 0.211700 0.204646 0.228809 0.244574 0.244727 0.229558 0.238316 0.224234 0.229505 0.207724 0.221478 0.230684 0.209225 0.244783 0.230824 0.230263
chargesum: 0.00000
title: Mulliken charges with hydrogens summed into heavy atoms:
elementType: S O O O O O O N C C C C C C C C C C C C C C C C C C C C C
charge: 0.963481 -0.273708 -0.281503 -0.533756 -0.535137 -0.272208 -0.263615 -0.325253 0.066655 -0.079001 0.293779 0.587260 -0.043725 -0.287219 -0.078462 0.194338 0.045408 0.036047 0.162381 -0.083384 -0.127798 -0.129753 0.163664 0.218837 0.449042 0.263291 -0.011176 -0.025766 -0.092718
polarizability: 3.89921069e+02 7.27217284e+00 2.61375547e+02 1.54218709e+01 -1.45470223e-01 2.34673864e+02
1716.lowfreq: -1.0187 -0.0565 -0.0007 -0.0002 3.4041 5.1999 9.7542 12.7581 15.7645
frequency: 9.3052 12.5506 15.7165 17.8409 23.6871 33.0982 38.7149 48.3370 60.7114 61.4056 74.8783 80.7238 89.3129 102.2518 112.1260 126.8208 137.9550 148.8036 158.8021 191.7968 205.8449 224.6514 226.1130 231.9471 238.9511 243.9521 259.6819 279.3797 285.3152 293.2362 311.7316 318.3126 344.7330 368.8240 389.5115 401.5986 407.0377 417.5147 423.0032 433.0257 470.8628 502.2803 507.7019 516.2111 531.3670 574.8046 581.1064 586.7027 622.3529 635.2381 675.5129 707.9604 720.9183 745.4678 775.1395 776.0321 801.3661 809.1846 813.9651 815.3891 824.4040 826.7178 834.2403 846.8372 850.3225 864.6642 884.5432 899.3726 922.3672 944.4137 952.2948 962.1716 966.2730 973.9580 981.1458 990.6437 993.1806 998.3803 1037.5253 1045.1582 1048.8121 1049.1493 1057.8648 1069.6451 1072.3872 1077.7387 1115.8334 1117.9150 1121.5624 1129.0008 1131.6244 1137.1410 1137.4063 1139.2920 1180.5869 1184.5485 1218.2867 1238.8013 1249.0524 1253.9357 1257.4372 1273.7109 1288.3168 1295.9692 1306.8794 1324.2333 1345.0821 1360.9316 1362.8699 1371.8954 1379.3996 1384.8386 1390.9615 1396.2690 1397.9498 1400.3791 1404.2986 1437.4765 1441.3119 1445.4910 1460.1585 1461.4001 1470.2396 1470.9454 1474.1588 1475.9240 1478.0289 1479.2690 1486.0033 1489.0462 1494.0846 1591.5200 1594.4935 1609.3045 1628.0827 2915.7947 2936.9024 2955.2732 2958.5105 2978.1935 2981.0368 2989.5798 2991.6964 2994.0240 2994.2375 3038.4742 3040.4714 3058.3529 3063.8780 3089.9153 3092.1548 3092.8514 3100.5639 3100.9058 3107.1152 3134.6334 3136.1509 3140.8152 3160.1765 3163.3192 3175.4874 3179.3776
redmass: 1.0500 5.3093 4.4454 4.0883 5.2459 4.8374 3.8974 4.1014 5.7810 2.4626 2.5010 2.1457 2.6492 2.6486 4.0619 6.6877 5.1628 4.9396 6.0617 3.4158 3.2519 7.2034 3.5342 5.9449 1.6135 1.4494 3.7938 3.9036 5.5862 3.4218 4.0222 4.1176 3.1730 3.8387 6.5199 5.3289 2.8919 3.1589 3.9148 6.7505 4.0298 3.4436 3.2772 4.2477 4.5808 4.7664 5.2761 5.4529 6.9607 5.7411 9.0098 3.3466 4.9591 4.9122 5.5669 5.5748 6.4069 2.5455 1.1113 1.1658 1.8919 1.4474 4.7672 2.3234 1.2427 2.9020 1.6058 3.0784 3.1419 7.6292 3.2726 1.3021 1.4686 5.0993 1.3990 1.4526 5.0162 2.6976 3.2243 2.7972 1.7473 2.1916 3.6817 2.7880 1.5212 2.9174 2.2024 1.5184 1.9668 1.0981 2.7102 1.4536 1.4807 1.6479 1.6390 1.1439 2.9809 1.3536 3.6763 1.1532 1.1533 1.4710 1.3195 1.2682 1.1502 1.2029 1.3235 1.2645 1.2512 1.3479 5.9274 1.2500 3.0416 1.2717 1.2193 1.3253 3.1375 1.4741 2.0595 1.0836 1.0407 1.0429 1.1068 2.3203 1.0598 1.4785 1.1251 1.0684 1.6008 1.0840 1.0804 6.8730 5.9908 7.6745 8.0289 1.0831 1.0568 1.0636 1.0621 1.0578 1.0388 1.1059 1.0620 1.0360 1.0359 1.1002 1.1033 1.0968 1.0948 1.0986 1.0992 1.1001 1.1012 1.1010 1.1088 1.0890 1.0892 1.0915 1.0952 1.0966 1.0928 1.0952
irintensity: 0.3529 1.1067 1.9998 1.0290 0.1729 0.4279 1.8912 0.5273 1.5813 0.9136 0.0887 0.4261 12.2994 4.0085 2.7393 3.5439 1.9874 1.7913 0.5797 2.1839 1.7414 5.3809 0.4457 2.0266 0.5005 3.5443 1.2471 4.4332 3.6193 7.5709 4.3579 2.0311 8.3938 0.6593 13.9012 5.2784 0.0073 6.4689 37.4143 81.2840 5.6487 46.5532 20.5660 6.2494 38.6124 3.2842 38.6762 5.6462 0.3771 9.8864 0.6692 1.7472 3.6619 8.2584 10.4492 18.3076 76.9094 20.3835 8.7889 6.4013 30.1152 39.3497 35.1652 23.2771 1.0968 16.4831 29.8455 9.0740 45.1435 277.7355 16.2110 0.4773 15.3129 122.9004 1.6310 2.3337 3.4774 3.9387 120.4369 40.3139 32.8504 10.2282 15.2283 47.7958 2.6052 103.3115 18.9410 30.4621 11.5749 0.4348 27.7809 1.4956 4.9827 9.9263 14.7843 12.4475 8.7208 58.1521 185.1519 5.0534 1.8857 35.0795 5.4232 2.9616 10.6530 37.7658 14.3054 19.3059 4.4054 7.9355 0.1003 16.5578 10.3378 23.6803 15.3256 13.0813 18.7648 27.2093 43.8884 44.6777 11.4909 8.4841 17.1379 31.6510 14.0761 43.3216 20.0170 7.9874 66.4051 4.9880 7.9936 0.0348 8.4706 3.8246 0.7063 18.7006 44.6936 30.3636 61.5677 14.9325 27.3435 41.9831 148.3397 31.6309 18.4133 21.5283 3.6821 4.9047 17.2186 39.3978 30.2945 14.3118 43.5600 35.1302 32.2491 12.3724 9.7341 2.1530 1.7604 9.8690 3.5443 5.3618
temp: 298.150 k
press: 1.00000 atm
elementType: 16 8 8 8 8 8 8 7 6 6 6 6 6 6 6 6 6 6 6 6 6 6 6 6 6 6 6 6 6 1 1 1 1 1 1 1 1 1 1 1 1 1 1 1 1 1 1 1 1 1 1 1 1 1 1 1
symmnumber: 1
zpe: 1165439.2 jmol-1
zpe.correction: 0.443892 hartree
zpe.thermalcorrener: 0.475103 hartree
zpe.thermalcorrenthalpy: 0.476047 hartree
zpe.thermalcorrgfe: 0.374747 hartree
zpe.sumelectzpe: -1718.170934 hartree
zpe.sumelectthermal: -1718.139723 hartree
zpe.sumelectthermalent: -1718.138779 hartree
zpe.sumelectthermalfe: -1718.240080 hartree
dipole: 1.3815 0.4025 4.5762
dipole: 4.7971
quadrupole: -139.9729 -172.5572 -190.7482
quadrupole: -5.9548 14.6734 -11.7380
quadrupole: 27.7865 -4.7978 -22.9888 -5.9548 14.6734 -11.7380
hfenergy: -1718.6148265 hartree
pointgroup: C01 [X(C21H27N1O6S1)]
dipole: 0.3607656 -0.0402752 1.8521001 debye
polarizability: 383.4131674|-16.182966|263.1094166|30.8085627|-3.1056181|239.4478951 unknown
InChI: InChI=1S/C21H27NO6S/c1-4-25-21(26-5-2)14-22(29(23,24)18-9-6-16(3)7-10-18)13-17-8-11-19-20(12-17)28-15-27-19/h6-12,21H,4-5,13-15H2,1-3H3
charge 0 multiplicity 1
56 atoms
S  2.180046 -0.652934 -1.494511
O  0.205868 3.721042 0.056571
O  -0.924755 2.04406 1.258256
O  2.839329 0.592566 -2.309884
O  1.592369 -1.987775 -2.220253
O  -5.140953 -0.55903 0.54422
O  -5.4952 -1.32304 -1.701635
N  0.706406 0.085175 -0.610658
C  1.02114 1.387505 0.013553
C  -0.092133 -0.918281 0.153807
C  -0.216242 2.31113 0.035954
C  -1.515859 -1.030172 -0.385409
C  3.467205 -1.248038 -0.237262
C  -2.616939 -0.708863 0.458112
C  -1.730974 -1.476852 -1.714548
C  -3.89675 -0.860522 -0.078597
C  4.408874 -0.322651 0.244344
C  3.433933 -2.594099 0.16391
C  -4.106188 -1.306123 -1.399411
C  -3.039564 -1.61876 -2.247583
C  5.351174 -0.776485 1.192865
C  4.388584 -3.022099 1.112684
C  0.357353 4.302198 -1.294832
C  -2.21715 2.767698 1.36379
C  5.354183 -2.124677 1.641776
C  -6.168686 -1.068992 -0.401287
C  0.756526 5.766145 -1.11701
C  -2.754476 2.543785 2.775384
C  6.394102 -2.604853 2.637369
H  1.396838 1.299606 1.055334
H  1.78997 1.870349 -0.615793
H  0.401322 -1.90597 0.064913
H  -0.101378 -0.63455 1.223051
H  -0.857071 2.130062 -0.859625
H  -2.459431 -0.344926 1.476492
H  -0.859804 -1.710923 -2.336612
H  4.422194 0.706102 -0.12974
H  2.707144 -3.284856 -0.275904
H  -3.208228 -1.958567 -3.272581
H  -0.60385 4.210672 -1.846379
H  1.132661 3.747936 -1.865374
H  -2.913957 2.368444 0.596259
H  -2.035813 3.841034 1.168502
H  6.097643 -0.07573 1.584263
H  4.386631 -4.067932 1.440751
H  -6.574603 -2.023281 -0.013227
H  -6.941066 -0.297635 -0.54198
H  -0.016139 6.314341 -0.550608
H  1.708807 5.842604 -0.564707
H  0.881923 6.251436 -2.10205
H  -2.923902 1.470986 2.973405
H  -2.041222 2.928052 3.524549
H  -3.717665 3.070527 2.903236
H  7.306647 -2.951256 2.11465
H  6.698098 -1.798896 3.327526
H  6.020127 -3.450587 3.239734
