program: Gaussian 09
title: 000227660
version: EM64L-G09RevD.01
frameworkgroup: C1[X(C9H14N2O2)]
method: RPBEPBE
basis: SDD
operation: Freq
keyword: #p
keyword: freq=noraman
keyword: PBEPBE/SDD
title: #p freq=noraman PBEPBE/SDD
converged: NO YES NO NO
title: Mulliken charges:
elementType: O O N N C C C C C C C C C H H H H H H H H H H H H H H
charge: -0.216243 -0.233739 -0.450127 -0.401646 0.294131 -0.067445 -0.445291 -0.443448 -0.416912 -0.401843 0.112674 -0.748096 0.157367 0.233473 0.217093 0.233195 0.211799 0.192505 0.194545 0.218596 0.204172 0.209729 0.322109 0.220579 0.237535 0.218290 0.346997
chargesum: 0.00000
title: Mulliken charges with hydrogens summed into heavy atoms:
elementType: O O N N C C C C C C C C C
charge: -0.216243 -0.233739 -0.128018 -0.054649 0.294131 0.166028 0.004997 -0.039143 -0.003771 0.012058 0.112674 -0.071692 0.157367
polarizability: 1.28613160e+02 3.68198681e+00 1.02325941e+02 4.46151686e+00 7.85394908e+00 9.85234567e+01
1716.lowfreq: -8.0779 -0.0004 -0.0003 -0.0002 8.8272 20.9426 74.5865 96.4058 147.8129
frequency: 74.1633 96.1302 147.7899 160.3280 167.5803 195.5959 239.5382 260.4588 292.9859 337.0608 383.2435 396.5222 421.4044 453.2292 492.9797 554.3536 565.3213 603.9555 621.9439 637.8139 690.1997 728.4245 738.9439 810.5828 824.9052 865.9079 892.1942 919.7839 961.2193 981.5597 997.7554 1003.9053 1023.4567 1063.3510 1091.7470 1109.7780 1130.5574 1153.1662 1160.6464 1205.8799 1225.7031 1259.0458 1266.5474 1301.8018 1303.2204 1311.0672 1320.5920 1338.4680 1340.9040 1344.8602 1352.5116 1356.6903 1393.5678 1462.0828 1469.4024 1471.5387 1476.3894 1480.5581 1482.0938 1673.5057 1718.4764 2958.4181 2967.1407 2977.0019 2982.6558 2985.0757 2991.7359 3028.5272 3035.3124 3043.5780 3056.6155 3077.7429 3080.1127 3589.3400 3610.0464
redmass: 5.2448 3.3019 4.4024 6.5759 2.6306 1.0764 3.8721 3.1124 2.3557 2.4083 3.6917 3.4393 3.7396 1.1539 2.1306 2.5479 3.8767 7.8830 4.1047 1.2316 5.7560 6.4647 3.5615 1.7831 1.9202 2.5819 1.4200 2.0951 3.2160 1.4043 1.7947 1.7128 4.1309 1.9719 2.1118 1.7039 2.1465 2.1402 2.0602 2.9432 1.7144 1.3252 1.5240 2.0398 1.3399 2.4271 1.4102 1.4878 1.6411 1.5209 1.5134 1.7948 1.2069 1.0850 1.0829 1.0803 1.0739 1.0710 1.0503 8.5480 9.4277 1.0654 1.0656 1.0619 1.0363 1.0804 1.0618 1.0965 1.0941 1.1030 1.1033 1.0990 1.0996 1.0802 1.0797
irintensity: 0.2429 0.2623 2.4216 1.1049 0.0242 0.2821 2.2445 2.3190 1.1940 3.0489 10.9947 6.0563 3.1667 91.5452 5.6647 2.3696 2.7918 10.3725 4.5787 124.0149 4.1734 60.4902 22.6961 6.6883 1.7381 3.6458 9.8056 1.7432 8.6066 4.9602 20.2199 15.4916 14.5864 1.0095 3.8280 0.2502 6.7458 3.0879 2.9413 56.7993 7.7197 21.1794 17.0846 114.8765 7.7374 63.8212 17.3676 1.0873 19.9272 5.2760 1.1361 12.0612 14.1294 12.0633 7.0898 10.3544 5.2215 17.8010 10.0828 485.0273 442.2537 22.6674 31.9704 32.5210 23.6452 11.3348 20.2919 43.5850 50.9445 44.9762 36.7258 37.0733 27.0903 68.9951 31.1186
temp: 298.150 k
press: 1.00000 atm
elementType: 8 8 7 7 6 6 6 6 6 6 6 6 6 1 1 1 1 1 1 1 1 1 1 1 1 1 1
symmnumber: 1
zpe: 593280.1 jmol-1
zpe.correction: 0.225968 hartree
zpe.thermalcorrener: 0.237944 hartree
zpe.thermalcorrenthalpy: 0.238888 hartree
zpe.thermalcorrgfe: 0.188674 hartree
zpe.sumelectzpe: -610.360114 hartree
zpe.sumelectthermal: -610.348138 hartree
zpe.sumelectthermalent: -610.347194 hartree
zpe.sumelectthermalfe: -610.397408 hartree
dipole: 3.6764 -0.5000 -0.5160
dipole: 3.7460
quadrupole: -80.1467 -83.4344 -82.2447
quadrupole: -6.7862 -5.0002 -7.2410
quadrupole: 1.7952 -1.4925 -0.3028 -6.7862 -5.0002 -7.2410
hfenergy: -610.5860822 hartree
pointgroup: C01 [X(C9H14N2O2)]
dipole: -1.4446408 0.2600443 -0.1319066 debye
polarizability: 128.6073701|3.8699957|104.9663971|-4.4826187|-6.5767106|95.8887906 unknown
InChI: InChI=1S/C9H14N2O2/c1-6-4-2-3-5-9(6)7(12)10-8(13)11-9/h6,10-11H,2-5H2,1H3
charge 0 multiplicity 1
27 atoms
O  0.955178 -2.049972 1.367775
O  2.896353 1.648185 -0.827437
N  0.630884 1.01763 -0.426964
N  2.239523 -0.337724 0.339805
C  -0.108962 -0.074932 0.24635
C  -1.046039 -0.872932 -0.72635
C  -0.913928 0.438298 1.479074
C  -2.263721 -0.002978 -1.132139
C  -2.128856 1.294913 1.060761
C  -3.051197 0.52212 0.090559
C  1.059679 -0.970865 0.735549
C  -0.29586 -1.417316 -1.959478
C  2.010004 0.88518 -0.375124
H  -1.414163 -1.733532 -0.129937
H  -0.238085 1.014563 2.138768
H  -1.252889 -0.448983 2.04797
H  -2.927659 -0.604175 -1.782764
H  -1.917994 0.851525 -1.752575
H  -1.782803 2.233956 0.580191
H  -2.689562 1.599407 1.964571
H  -3.50418 -0.336504 0.626681
H  -3.885031 1.168855 -0.242663
H  0.196354 1.828673 -0.861002
H  0.149049 -0.597565 -2.552703
H  0.512531 -2.113661 -1.672576
H  -0.992236 -1.970581 -2.615192
H  3.180308 -0.683587 0.529152
