program: Gaussian 09
title: 000227657
version: EM64L-G09RevD.01
frameworkgroup: C1[X(C22H34)]
method: RPBEPBE
basis: SDD
operation: Freq
keyword: #p
keyword: freq=noraman
keyword: PBEPBE/SDD
title: #p freq=noraman PBEPBE/SDD
converged: YES YES NO NO
title: Mulliken charges:
elementType: C C C C C C C C C C C C C C C C C C C C C C H H H H H H H H H H H H H H H H H H H H H H H H H H H H H H H H H H
charge: 0.175241 0.175246 0.175245 0.175238 0.326763 0.326744 0.326747 0.326770 -0.492214 -0.492213 -0.492212 -0.492213 -0.658199 -0.658200 -0.746101 -0.750248 -0.746101 -0.750248 -0.746099 -0.750248 -0.746099 -0.750248 0.207060 0.198208 0.207060 0.198208 0.198208 0.207059 0.198209 0.207060 0.217268 0.217268 0.211513 0.208003 0.223569 0.222036 0.226254 0.210386 0.223569 0.208002 0.211512 0.210387 0.222036 0.226253 0.223569 0.211512 0.208003 0.210387 0.226253 0.222035 0.208003 0.223569 0.211514 0.222036 0.210386 0.226253
chargesum: 0.00000
title: Mulliken charges with hydrogens summed into heavy atoms:
elementType: C C C C C C C C C C C C C C C C C C C C C C
charge: 0.175241 0.175246 0.175245 0.175238 0.326763 0.326744 0.326747 0.326770 -0.086945 -0.086945 -0.086946 -0.086945 -0.440930 -0.440931 -0.103015 -0.091573 -0.103017 -0.091572 -0.103016 -0.091573 -0.103013 -0.091573
polarizability: 2.75223492e+02 2.89735477e-04 2.46204601e+02 1.37067751e-02 -4.69255654e-01 1.77464640e+02
1716.lowfreq: -25.3146 -19.8973 -11.6052 -0.0005 0.0005 0.0008 20.4995 31.8007 37.0219
frequency: 20.4995 31.8007 34.6014 75.0397 110.0362 130.6563 159.3790 183.6864 192.6154 206.5822 207.8639 208.1399 209.0088 228.6435 232.7371 251.4808 255.1435 261.2173 261.3472 261.4487 272.3602 284.8993 307.7983 329.2259 331.8761 337.8605 347.7343 366.7805 372.8552 403.8896 403.9576 447.2884 454.4201 463.1443 466.8948 498.5152 509.5892 512.1011 543.4674 550.3539 605.7042 625.5683 643.2508 694.3826 709.4661 745.6340 772.5740 777.8978 820.3418 842.2802 882.5946 886.9110 901.3663 901.4024 918.4199 924.9864 925.6036 925.8916 926.6718 931.3834 931.5764 951.6819 965.7032 966.3431 979.2023 999.6874 1000.4430 1020.0276 1020.0666 1058.2495 1058.7190 1082.0346 1084.3079 1090.7224 1108.7285 1122.4389 1180.9178 1181.6722 1186.5267 1187.8096 1192.1683 1202.8084 1216.3509 1219.3025 1226.8986 1240.2830 1258.3368 1258.6517 1281.1405 1285.7284 1312.7580 1340.0761 1342.3210 1343.4412 1343.9068 1353.6402 1369.9360 1370.2994 1371.2301 1371.7008 1372.3775 1390.0209 1390.1256 1391.6203 1396.1860 1451.8696 1452.6444 1457.6433 1458.0783 1460.5834 1462.6184 1462.9380 1466.2762 1470.8498 1472.5860 1472.8885 1474.4697 1475.8278 1479.7514 1480.0095 1481.0331 1484.1748 1485.7868 1487.3736 1489.9132 1495.2627 1545.4200 1611.8322 2966.7841 2966.9510 2967.2870 2967.3948 2968.6414 2968.6791 2970.2291 2970.4055 2972.3886 2972.4959 2977.7765 2978.5452 3019.4640 3019.6881 3030.3887 3030.5066 3059.2678 3059.2790 3059.6537 3059.7760 3064.3439 3064.5731 3065.0381 3065.9637 3072.5622 3072.5681 3073.4281 3073.5512 3077.1133 3077.1447 3077.8399 3078.0147 3122.5587 3126.5008
redmass: 3.2145 2.7866 2.7856 3.1003 2.9718 3.3072 1.9662 1.1719 1.7281 1.0961 1.5278 1.4538 2.0437 1.7948 1.8797 1.0371 1.1422 2.2934 1.1711 1.3473 2.3565 2.2949 2.6776 2.2126 2.7937 2.1904 2.3191 2.3366 2.3363 3.1069 1.9041 2.8583 2.5015 3.0432 3.7328 2.6626 2.7589 2.6337 3.1199 4.9860 2.9793 2.7289 4.2228 6.4005 7.2907 2.8033 2.7014 2.1560 2.3679 1.9658 1.9827 2.0683 1.5512 1.7232 2.9346 1.5123 1.4850 1.5061 1.5086 1.7483 1.7676 1.8277 1.4985 1.4930 1.7220 1.2683 1.2718 1.4620 1.4575 1.7677 1.8228 1.6391 1.6315 3.2075 2.4200 1.7137 3.2680 2.8684 2.5490 1.6846 2.5393 2.1974 2.8644 2.5579 3.1757 2.3200 2.1620 1.9779 1.2783 1.7315 2.5920 1.7124 1.4605 1.4421 1.4429 4.2928 3.3512 1.1848 1.1851 1.1920 1.2602 1.2093 1.2124 1.1993 1.3756 1.0655 1.0660 1.0562 1.0578 1.0488 1.0500 1.1078 1.0589 1.1686 1.0780 1.1629 1.0645 1.0680 1.0553 1.0590 1.0550 1.0582 1.0650 1.0640 1.0819 1.8583 9.9533 6.6658 1.0366 1.0367 1.0365 1.0371 1.0511 1.0504 1.0393 1.0401 1.0416 1.0418 1.0570 1.0560 1.0996 1.0995 1.1023 1.1022 1.0991 1.0991 1.0990 1.0991 1.0985 1.0985 1.0981 1.0979 1.0998 1.0999 1.0996 1.0997 1.0993 1.0992 1.0990 1.0989 1.0874 1.0883
irintensity: 0.0097 0.0424 0.0000 0.9021 0.0000 0.2908 0.0000 0.0011 0.0000 0.0543 0.0000 0.0000 0.0362 0.0000 0.0000 0.1627 0.1026 0.0544 0.0000 0.0000 0.0000 0.0012 0.1272 0.0000 0.1397 0.0000 0.8406 0.3532 0.0000 0.0001 0.7353 0.5493 0.0000 0.2018 0.0000 0.0000 0.0000 7.1061 4.2206 0.0000 0.7097 0.0000 0.8411 0.0000 0.6462 0.0000 0.0000 7.4978 0.0000 11.2648 0.0000 3.8482 15.6853 0.0002 0.0000 0.0000 4.8062 0.0011 0.0000 0.0000 5.4446 0.4903 0.5498 0.0000 0.0000 0.0000 1.2466 7.0267 0.0006 0.0000 22.0151 9.3823 0.0000 34.1394 0.0000 24.2504 0.0000 11.5802 3.0936 12.4685 0.0000 0.0000 3.7918 0.0000 11.2966 0.0000 0.0000 6.0549 0.0000 45.3494 0.0000 1.2590 14.7773 0.0000 0.0000 2.2370 5.9618 0.0036 0.0000 0.0000 72.5454 0.0000 0.5134 0.0000 57.3971 0.0000 0.1752 1.4214 0.0000 0.0000 1.8937 0.2591 0.0000 19.1758 0.0000 2.2842 0.0000 26.3345 0.0000 0.0000 42.9183 4.5733 0.0000 0.0000 22.7311 86.5831 0.0000 0.0000 3.2656 0.0000 0.0004 70.0963 0.0932 63.2435 0.0171 0.0000 0.0032 184.8063 136.0098 0.0003 85.0471 0.0095 0.0244 98.0854 0.0393 6.9310 0.0004 9.2673 0.0003 45.4391 323.6625 0.0001 18.7680 0.0318 0.0000 72.7693 143.8632 0.3296 0.0014 24.5330 50.1858 0.0000
temp: 298.150 k
press: 1.00000 atm
elementType: 6 6 6 6 6 6 6 6 6 6 6 6 6 6 6 6 6 6 6 6 6 6 1 1 1 1 1 1 1 1 1 1 1 1 1 1 1 1 1 1 1 1 1 1 1 1 1 1 1 1 1 1 1 1 1 1
symmnumber: 1
zpe: 1311610.0 jmol-1
zpe.correction: 0.499566 hartree
zpe.thermalcorrener: 0.523371 hartree
zpe.thermalcorrenthalpy: 0.524315 hartree
zpe.thermalcorrgfe: 0.448728 hartree
zpe.sumelectzpe: -857.055996 hartree
zpe.sumelectthermal: -857.032191 hartree
zpe.sumelectthermalent: -857.031247 hartree
zpe.sumelectthermalfe: -857.106834 hartree
dipole: 0.0000 0.0000 0.0000
dipole: 0.0000
quadrupole: -131.1814 -134.6295 -140.4088
quadrupole: -0.0001 0.0013 0.3195
quadrupole: 4.2252 0.7771 -5.0023 -0.0001 0.0013 0.3195
hfenergy: -857.5555618 hartree
pointgroup: C01 [X(C22H34)]
dipole: 0.0000043 -0.0000006 -0.0000003 debye
polarizability: 275.223492|-0.0014408|246.2046009|-0.0137254|-0.4692551|177.4646404 unknown
InChI: InChI=1S/C22H34/c1-19(2)9-10-20(3,4)16-14-18-17(13-15(16)19)21(5,6)11-12-22(18,7)8/h13-14H,9-12H2,1-8H3
charge 0 multiplicity 1
56 atoms
C  2.546503 -1.559834 0.001127
C  2.546615 1.559633 -0.001674
C  -2.546565 -1.559642 0.001889
C  -2.546452 1.559827 -0.000997
C  1.251544 -0.714012 0.010104
C  1.251591 0.713912 -0.010289
C  -1.251541 -0.71392 0.010468
C  -1.251495 0.714003 -0.009939
C  3.769763 -0.672956 0.369871
C  3.769676 0.672675 -0.370869
C  -3.769619 -0.672672 0.37108
C  -3.769716 0.672937 -0.369701
C  -0.000023 -1.375032 0.00713
C  0.000073 1.375023 -0.006959
C  2.477536 -2.719645 1.035338
C  2.74436 -2.174461 -1.418136
C  2.477416 2.719516 -1.035789
C  2.744973 2.174157 1.417564
C  -2.477352 -2.719496 1.036035
C  -2.744946 -2.174206 -1.417329
C  -2.477479 2.719588 -1.035264
C  -2.744313 2.174522 1.418236
H  3.770454 -0.495712 1.464154
H  4.697069 -1.235321 0.14142
H  3.769952 0.495434 -1.465153
H  4.697108 1.234969 -0.142754
H  -4.697056 -1.234971 0.142999
H  -3.769873 -0.495397 1.465358
H  -4.69702 1.235307 -0.141258
H  -3.77042 0.495657 -1.463978
H  -0.000064 -2.470735 0.013988
H  0.000114 2.470726 -0.013816
H  3.459792 -3.227337 1.091867
H  1.727068 -3.483129 0.76303
H  2.227458 -2.338274 2.042321
H  1.874302 -2.79494 -1.700964
H  2.857948 -1.392071 -2.189807
H  3.646572 -2.816085 -1.438127
H  2.227005 2.338229 -2.042721
H  1.727087 3.483038 -0.763204
H  3.459693 3.227139 -1.092581
H  3.647238 2.815713 1.437309
H  1.875049 2.794682 1.700707
H  2.858748 1.391709 2.18915
H  -2.226926 -2.33818 2.042953
H  -3.459628 -3.227118 1.092855
H  -1.727026 -3.483025 0.763461
H  -3.64721 -2.815765 -1.43704
H  -2.858734 -1.391782 -2.188936
H  -1.875026 -2.794739 -1.700467
H  -1.727003 3.483079 -0.762993
H  -2.227403 2.338166 -2.042228
H  -3.45973 3.227285 -1.091817
H  -1.874247 2.794998 1.701046
H  -3.646514 2.816162 1.438187
H  -2.857924 1.392167 2.18994
