program: Gaussian 09
title: 000227651
version: EM64L-G09RevD.01
frameworkgroup: C1[X(C19H24O)]
method: RPBEPBE
basis: SDD
operation: Freq
keyword: #pfreq=noraman
keyword: PBEPBE/SDD
title: #p freq=noraman PBEPBE/SDD
converged: YES YES NO NO
title: Mulliken charges:
elementType: O C C C C C C C C C C C C C C C C C C C H H H H H H H H H H H H H H H H H H H H H H H H
charge: -0.237249 -0.059212 0.239255 0.086281 -0.021560 -0.568830 -0.522929 0.373764 -0.446048 0.178314 -0.730071 -0.736490 -0.633891 -0.752632 -0.666761 0.220367 0.373933 -0.803048 0.064295 -0.800786 0.215099 0.219370 0.223300 0.214824 0.222238 0.205386 0.207283 0.221353 0.236737 0.213629 0.235911 0.221142 0.221089 0.253688 0.210116 0.216117 0.219673 0.248054 0.208326 0.248582 0.248061 0.236160 0.235805 0.261353
chargesum: 0.00000
title: Mulliken charges with hydrogens summed into heavy atoms:
elementType: O C C C C C C C C C C C C C C C C C C C
charge: -0.237249 -0.059212 0.239255 0.086281 0.193540 -0.126160 -0.085867 0.373764 -0.033379 0.178314 -0.058352 -0.058348 -0.380202 -0.106726 -0.418707 0.220367 0.373933 -0.098079 0.064295 -0.067469
polarizability: 3.11017445e+02 -1.55298361e+01 2.23550604e+02 2.65587111e-01 1.14385308e+00 1.28229173e+02
1716.lowfreq: -9.2701 0.0005 0.0006 0.0007 3.9296 7.4136 30.4691 41.3130 63.5352
frequency: 30.3167 41.2873 63.5331 81.2313 105.1568 108.9509 168.5026 176.1324 184.4680 188.6510 206.1511 212.1174 216.1648 229.1321 231.9496 245.3033 263.0880 275.4068 284.7875 309.1873 359.1203 383.3133 394.1618 405.3753 424.9375 429.9947 453.3798 460.6653 520.9069 549.5235 552.3396 587.7460 613.7947 622.8118 666.1612 689.3072 699.9298 733.8727 770.2215 789.5346 824.9925 874.5695 884.6121 895.9029 906.2790 924.3932 926.5921 935.4721 939.0320 955.4381 1005.4219 1007.4128 1008.4250 1017.7927 1021.5794 1044.0864 1053.7433 1072.9375 1090.7450 1103.7749 1121.3298 1145.2446 1152.0582 1155.3332 1182.9897 1215.1789 1218.2302 1231.9643 1250.0948 1258.2383 1265.9949 1279.0721 1297.7408 1318.3412 1333.0666 1357.5167 1362.8576 1373.1905 1374.0554 1385.2966 1387.8771 1395.1495 1407.4084 1408.1695 1448.5699 1448.6175 1450.4356 1455.1667 1460.9871 1465.3391 1466.3663 1467.0798 1467.9308 1475.5397 1476.0360 1477.1662 1482.2135 1487.0527 1547.4109 1585.8277 1623.3715 1631.6144 2941.0033 2943.8742 2956.9962 2966.8022 2972.1818 2974.8190 2977.5308 2983.5681 2987.3749 2993.7680 3001.4802 3036.2738 3061.0480 3066.9067 3067.5256 3070.2063 3072.0970 3076.0513 3082.5762 3084.5495 3086.3416 3121.1162 3122.5329 3143.1462
redmass: 3.4441 5.0354 2.9943 2.9248 3.0355 4.0602 2.3717 1.0729 2.5775 2.2178 1.1155 1.2180 2.3098 1.2527 2.2478 2.1990 1.1441 3.2271 3.1042 3.2164 3.0501 2.9475 3.2300 3.2676 4.1318 2.6703 3.0840 3.1633 3.4856 3.5534 3.0343 3.7168 3.8818 3.6697 3.7579 3.7871 5.2183 3.5146 3.2901 2.2362 2.2996 1.4696 3.0854 1.5439 1.4934 2.0420 2.0132 1.4662 1.7398 1.7243 1.4653 1.8335 1.6185 1.7607 2.1545 1.6277 1.9471 2.5850 1.7991 2.4851 1.5493 2.3538 1.9779 2.3313 3.0022 1.8016 2.6753 1.7647 1.5108 1.8592 1.4122 2.4088 1.3294 1.9895 1.3816 1.7319 1.2428 1.9495 1.5787 2.1743 1.2356 1.4000 4.0321 1.4250 1.0745 1.1074 1.1040 1.0836 1.0489 1.2432 1.0912 1.0746 1.0540 1.0607 1.4978 1.0651 1.0724 1.6184 7.5435 7.8625 7.5740 7.5565 1.0635 1.0656 1.0774 1.0382 1.0664 1.0344 1.0348 1.0371 1.0367 1.0890 1.0963 1.1021 1.0990 1.1000 1.0992 1.0975 1.0992 1.0955 1.1008 1.1010 1.1002 1.0989 1.0914 1.0896
irintensity: 3.0353 1.1005 0.3280 1.0532 0.1601 0.3672 0.1463 1.6728 0.8497 1.3516 0.2602 0.0248 0.1884 0.2186 0.6686 1.6480 0.0935 1.2579 0.3593 2.2901 1.7412 3.1380 0.8038 0.2996 5.9456 0.0460 0.4430 1.0793 6.5382 5.1986 4.5301 3.5771 7.5972 4.2916 3.0220 0.1858 1.4005 7.0395 0.7987 1.1406 0.6458 7.1864 7.4243 15.6876 8.2629 16.3084 2.6935 1.3622 10.5635 13.3867 0.2591 0.0233 6.8924 0.2453 3.6110 10.7226 10.2720 4.5609 2.2188 3.1224 1.7006 4.1810 4.2202 2.8388 4.5665 0.4123 35.7573 69.2597 45.5889 53.0757 2.6097 105.1129 0.2160 4.5905 2.1014 2.4893 40.6009 16.4753 16.9634 41.0302 11.9659 27.0904 18.2087 22.3265 23.8207 38.4606 2.1141 8.0576 0.4120 7.6333 19.0053 9.2320 6.0826 15.2084 3.3594 8.4913 18.2432 44.3675 171.1469 159.0710 109.0543 0.2111 34.5225 16.6442 15.5910 27.3951 56.8211 22.1586 48.3934 5.6675 26.3723 46.3483 31.8930 45.8755 55.5317 0.1320 41.9720 14.6447 57.5781 9.7593 16.8773 23.5381 37.6163 23.7142 18.0367 7.3757
temp: 298.150 k
press: 1.00000 atm
elementType: 8 6 6 6 6 6 6 6 6 6 6 6 6 6 6 6 6 6 6 6 1 1 1 1 1 1 1 1 1 1 1 1 1 1 1 1 1 1 1 1 1 1 1 1
symmnumber: 1
zpe: 985751.1 jmol-1
zpe.correction: 0.375453 hartree
zpe.thermalcorrener: 0.395632 hartree
zpe.thermalcorrenthalpy: 0.396576 hartree
zpe.thermalcorrgfe: 0.327787 hartree
zpe.sumelectzpe: -812.182072 hartree
zpe.sumelectthermal: -812.161893 hartree
zpe.sumelectthermalent: -812.160949 hartree
zpe.sumelectthermalfe: -812.229738 hartree
dipole: -4.7107 2.3664 0.1244
dipole: 5.2731
quadrupole: -134.6281 -113.1386 -121.7521
quadrupole: 9.8962 -0.1565 0.0535
quadrupole: -11.4552 10.0344 1.4208 9.8962 -0.1565 0.0535
hfenergy: -812.5575249 hartree
pointgroup: C01[X(C19H24O1)]
dipole: -1.8334522 -0.9693678 -0.0528376 debye
polarizability: 309.9508173|18.046242|223.4867403|-6.6272227|8.5330259|129.3596644 unknown
InChI: InChI=1S/C19H24O/c1-11-6-7-17-15(8-11)16-9-12(2)14(13(3)20)10-18(16)19(17,4)5/h9-11H,6-8H2,1-5H3
charge 0 multiplicity 1
44 atoms
O  5.023293 1.217228 -0.220236
C  -0.596784 -1.692364 -0.26017
C  -1.86592 -0.834331 -0.108799
C  -1.561115 0.503189 0.008366
C  -4.015579 1.093664 -0.214691
C  -3.274939 -1.369132 -0.095076
C  -2.591786 1.599332 0.151014
C  0.497936 -0.61872 -0.203661
C  -4.269331 -0.297518 0.423895
C  -0.099104 0.667345 -0.041151
C  -0.455025 -2.70893 0.910328
C  -0.591816 -2.449492 -1.620908
C  1.884128 -0.736749 -0.283218
C  -5.094073 2.115351 0.200312
C  0.711834 1.818466 0.039601
C  2.726843 0.421009 -0.202692
C  2.125731 1.722955 -0.037493
C  2.92977 3.006128 0.05914
C  4.209207 0.242447 -0.292356
C  4.777343 -1.17037 -0.479501
H  -4.054351 0.967425 -1.318136
H  -3.567453 -1.687855 -1.119448
H  -3.341628 -2.283337 0.529709
H  -2.593117 1.984373 1.193826
H  -2.325323 2.464369 -0.489728
H  -5.308897 -0.620095 0.220939
H  -4.167821 -0.205646 1.524797
H  0.49287 -3.270589 0.821419
H  -0.460493 -2.193154 1.886753
H  -1.283906 -3.440993 0.895073
H  -0.679988 -1.744881 -2.466641
H  0.346075 -3.021572 -1.744169
H  -1.43378 -3.16482 -1.671109
H  2.340413 -1.724048 -0.408478
H  -5.124805 2.227766 1.301506
H  -4.892045 3.112684 -0.233848
H  -6.099137 1.798188 -0.13449
H  0.256294 2.807896 0.165936
H  2.253362 3.871025 0.178862
H  3.637901 2.979991 0.905421
H  3.559966 3.160295 -0.833898
H  4.410625 -1.635045 -1.413543
H  4.498291 -1.835191 0.358956
H  5.874332 -1.093993 -0.524909
