program: Gaussian 09
title: 000227648
version: EM64L-G09RevD.01
frameworkgroup: C1[X(C18H24O)]
method: RPBEPBE
basis: SDD
operation: Freq
keyword: #pfreq=noraman
keyword: PBEPBE/SDD
title: #p freq=noraman PBEPBE/SDD
converged: YES YES NO YES
title: Mulliken charges:
elementType: O C C C C C C C C C C C C C C C C C C H H H H H H H H H H H H H H H H H H H H H H H H
charge: -0.218644 0.227454 0.172246 0.168155 -0.502337 -0.498505 0.397617 0.078666 -0.785384 -0.762669 -0.748956 -0.740171 -0.017606 -0.685919 -0.529598 0.364620 -0.544178 0.009045 -0.804704 0.213036 0.203094 0.210713 0.203037 0.224554 0.217922 0.238812 0.217822 0.228896 0.216843 0.228315 0.215077 0.226951 0.225122 0.214886 0.213249 0.236001 0.248962 0.228150 0.249504 0.247919 0.249068 0.215186 0.247749
chargesum: 0.00000
title: Mulliken charges with hydrogens summed into heavy atoms:
elementType: O C C C C C C C C C C C C C C C C C C
charge: -0.218644 0.227454 0.172246 0.168155 -0.086207 -0.084755 0.397617 0.078666 -0.104097 -0.099108 -0.078614 -0.086914 -0.017606 -0.449918 -0.052485 0.364620 -0.046755 0.009045 -0.092701
polarizability: 2.46935915e+02 4.82786235e-01 2.11243682e+02 2.59131745e-01 4.55068949e-01 1.31137449e+02
1716.lowfreq: -11.0304 -7.7950 -0.0004 -0.0004 0.0006 12.2318 43.8063 65.1691 77.4754
frequency: 43.7790 65.0974 77.4623 114.4664 116.7989 144.3304 172.6446 190.1484 204.9223 214.0931 225.5468 232.9812 245.2558 250.7124 264.9416 271.1700 283.7941 305.3906 324.4640 353.9032 367.4041 391.6169 405.1182 443.1560 459.8876 492.3961 510.1193 521.4806 535.0808 540.1702 583.7545 626.6454 638.7804 655.3817 680.9250 729.6081 769.6388 771.8606 848.4815 856.0768 886.9741 901.1184 906.7027 928.6104 930.9919 936.8430 968.8766 974.8761 976.6160 994.2755 1005.2230 1009.6619 1022.1286 1030.5470 1045.5703 1066.3835 1072.0669 1084.1275 1127.7652 1137.5802 1179.9019 1182.4934 1195.8756 1210.9505 1218.6017 1221.8353 1241.1338 1253.6232 1272.2692 1274.0785 1287.3223 1310.9370 1345.1251 1347.1326 1360.3351 1370.1515 1375.8394 1377.8686 1394.8980 1397.4307 1405.7088 1435.7558 1450.7954 1453.5877 1455.6329 1460.2957 1462.6806 1464.4307 1467.2694 1470.3407 1473.7032 1477.5129 1485.5101 1487.1288 1490.6844 1500.2049 1566.2511 1602.5307 1616.9008 2971.8885 2973.3908 2974.9869 2976.2430 2979.7415 2982.6227 2987.0232 3001.9100 3010.0155 3024.2123 3034.5375 3054.9751 3063.2818 3066.1125 3069.5274 3069.9841 3071.2211 3076.8463 3078.4628 3082.9227 3084.2252 3087.7891 3105.1052 3131.2371
redmass: 3.2292 3.2779 3.9750 2.3320 1.1554 1.9235 1.7752 1.5202 1.3225 1.9334 2.2886 1.7604 1.9384 2.2044 1.7003 2.5156 3.0446 2.1194 2.5960 2.2135 2.9998 2.5159 2.9686 3.3686 2.8342 2.9369 3.5885 2.7727 3.2814 3.5813 3.6724 4.2848 3.2423 3.9611 4.7020 4.9606 2.7528 2.4805 2.2510 2.1279 1.9992 1.4377 3.3574 1.5198 1.5262 1.7351 1.5387 2.7417 2.2965 1.9070 1.3055 1.7519 1.4535 2.7880 1.5872 2.0602 2.3309 1.7325 2.0463 1.2187 2.5691 2.8681 1.9579 2.1129 2.4272 1.8992 1.9363 1.5380 1.9037 2.1605 1.7851 3.2221 1.4452 1.6469 4.0623 4.0776 1.2020 1.1941 1.2060 1.2243 1.2213 1.1214 1.5208 1.0481 1.3998 1.1111 1.0969 1.1589 1.0600 1.1015 1.0917 1.0686 1.0828 1.0682 1.0779 1.0579 8.3125 6.7712 11.0371 1.0513 1.0428 1.0398 1.0390 1.0429 1.0506 1.0364 1.0599 1.0659 1.0993 1.1025 1.0993 1.0987 1.0994 1.0958 1.0979 1.0985 1.0997 1.0995 1.0986 1.0989 1.1012 1.0966 1.0894
irintensity: 0.0561 0.8356 2.5260 3.6619 0.8928 0.5655 0.2288 0.2082 0.5172 0.1208 0.8952 0.3259 2.0705 2.4369 0.0527 0.0893 0.2079 0.4202 0.0675 0.1542 0.7660 1.7703 0.9857 0.6960 0.6408 0.5387 2.8551 2.5769 1.2318 1.2831 0.8217 5.1150 1.3390 3.6746 6.0746 1.5849 6.4387 0.7727 2.3695 3.4769 1.3626 7.9184 6.5922 1.1828 0.8161 4.3050 1.7681 10.6479 0.6267 2.1858 1.4276 15.0094 2.5152 2.6939 7.9287 22.2994 24.3642 3.2790 45.7704 2.4635 3.4400 2.9789 8.6322 4.5150 9.2986 3.5076 6.1671 1.2767 7.9845 82.1177 5.4490 7.6249 3.8523 1.0079 1.0102 6.4957 5.3540 36.1341 3.0970 18.8802 22.8400 18.1036 1.2866 10.5867 1.5114 6.3016 17.9481 26.3461 4.1922 5.1940 10.3961 13.0561 18.0827 15.0252 15.1857 6.1744 135.2556 23.2633 286.2952 3.7803 28.4431 34.4636 16.8599 69.1065 58.3538 19.4868 28.4332 13.6900 39.6292 47.2743 9.5539 22.7376 4.8002 10.0501 33.0306 105.5494 20.8818 22.1405 30.1885 31.6883 22.1308 33.8675 23.4077
temp: 298.150 k
press: 1.00000 atm
elementType: 8 6 6 6 6 6 6 6 6 6 6 6 6 6 6 6 6 6 6 1 1 1 1 1 1 1 1 1 1 1 1 1 1 1 1 1 1 1 1 1 1 1 1
symmnumber: 1
zpe: 974594.1 jmol-1
zpe.correction: 0.371203 hartree
zpe.thermalcorrener: 0.390098 hartree
zpe.thermalcorrenthalpy: 0.391042 hartree
zpe.thermalcorrgfe: 0.326273 hartree
zpe.sumelectzpe: -774.135450 hartree
zpe.sumelectthermal: -774.116555 hartree
zpe.sumelectthermalent: -774.115611 hartree
zpe.sumelectthermalfe: -774.180379 hartree
dipole: -4.2405 1.5890 0.0590
dipole: 4.5289
quadrupole: -131.0743 -107.3303 -115.7336
quadrupole: 6.8080 0.2438 0.1742
quadrupole: -13.0283 10.7157 2.3125 6.8080 0.2438 0.1742
hfenergy: -774.5066529 hartree
pointgroup: C01 [X(C18H24O1)]
dipole: 1.6732075 0.6123905 -0.0115166 debye
polarizability: 246.9151931|-0.7483958|211.2502727|1.1729244|-0.6653972|131.1515797 unknown
InChI: InChI=1S/C18H24O/c1-11-10-13-16(12-6-7-14(19)15(11)12)18(4,5)9-8-17(13,2)3/h10H,6-9H2,1-5H3
charge 0 multiplicity 1
43 atoms
O  -4.342885 -0.519192 -0.040179
C  1.451607 1.732991 0.02818
C  2.378518 -1.238244 -0.0217
C  0.444872 0.550333 0.031701
C  2.881419 1.232083 0.389616
C  3.286135 -0.031404 -0.374975
C  0.887273 -0.817527 0.006891
C  -0.966498 0.762479 0.019188
C  1.110575 2.827953 1.083908
C  1.486816 2.384539 -1.389391
C  2.770834 -1.803482 1.378718
C  2.635537 -2.3415 -1.090829
C  -1.885594 -0.322821 0.00706
C  -0.06449 -1.877286 0.035594
C  -1.745833 2.08699 0.039783
C  -1.456228 -1.677875 0.038538
C  -3.226772 1.699513 -0.203348
C  -3.282448 0.169453 -0.062984
C  -2.424665 -2.841357 0.058024
H  2.931156 1.041468 1.480232
H  3.595649 2.052833 0.181354
H  3.235889 0.157039 -1.465582
H  4.337334 -0.298669 -0.150427
H  0.861014 2.377133 2.062026
H  1.996197 3.476109 1.226559
H  0.279038 3.4817 0.778223
H  2.175197 3.251303 -1.391642
H  1.83179 1.668273 -2.155809
H  0.490123 2.743126 -1.700314
H  2.126502 -2.656078 1.658747
H  3.820006 -2.155026 1.365063
H  2.672056 -1.039128 2.169971
H  2.25445 -2.032111 -2.081066
H  3.724357 -2.517731 -1.180176
H  2.166719 -3.306569 -0.830363
H  0.303324 -2.90932 0.043996
H  -1.638532 2.571817 1.027122
H  -1.377266 2.810489 -0.707561
H  -3.559942 1.962413 -1.225499
H  -3.934468 2.176693 0.496242
H  -3.105713 -2.811126 -0.81119
H  -1.883893 -3.803539 0.058095
H  -3.082357 -2.800044 0.944703
