program: Gaussian 09
title: 000227645
version: EM64L-G09RevD.01
frameworkgroup: C1[X(C17H22O)]
method: RPBEPBE
basis: SDD
operation: Freq
keyword: #pfreq=noraman
keyword: PBEPBE/SDD
title: #p freq=noraman PBEPBE/SDD
converged: YES YES NO NO
title: Mulliken charges:
elementType: O C C C C C C C C C C C C C C C C C H H H H H H H H H H H H H H H H H H H H H H
charge: -0.217246 0.159202 -0.181035 -0.474299 0.169486 0.416058 -0.480453 0.087506 -0.740122 -0.743988 -0.023770 -0.536729 -0.695792 -0.747466 0.379470 -0.527494 0.005167 -0.807194 0.215353 0.203790 0.208995 0.204179 0.213919 0.224094 0.214928 0.214548 0.226595 0.214376 0.228731 0.235103 0.237576 0.236811 0.220613 0.219946 0.227840 0.250252 0.249588 0.215603 0.246414 0.249443
chargesum: 0.00000
title: Mulliken charges with hydrogens summed into heavy atoms:
elementType: O C C C C C C C C C C C C C C C C C
charge: -0.217246 0.159202 0.034318 -0.061514 0.169486 0.416058 -0.062355 0.087506 -0.086553 -0.074286 -0.023770 -0.064049 -0.458981 -0.079066 0.379470 -0.027654 0.005167 -0.095733
polarizability: 2.38166391e+02 -1.14395935e-01 1.97148871e+02 -1.04423730e-01 3.22151454e+00 1.21468585e+02
1716.lowfreq: -13.2330 -7.0754 -0.0009 -0.0008 -0.0006 5.7537 45.8827 67.5494 73.9627
frequency: 45.8192 67.5068 73.9309 85.1113 104.5344 128.8629 170.3686 182.8729 199.9479 214.7785 225.5316 233.6038 245.8758 250.7662 276.4506 299.1101 320.5751 347.6102 377.8457 402.9069 429.5268 449.1690 490.0099 513.0164 519.7936 526.9116 539.8838 579.5852 622.8586 662.3576 662.9844 697.9594 740.1947 761.0082 794.1616 841.5432 859.4808 895.6880 904.8657 910.2094 929.9237 944.7293 965.8342 973.0587 990.7189 996.3115 1004.8244 1009.1753 1026.0026 1037.9638 1045.0111 1055.0147 1083.7860 1122.4586 1133.7154 1152.3105 1172.0787 1198.6347 1202.4370 1207.9060 1218.3005 1243.2818 1252.2910 1270.0848 1271.3924 1301.8251 1307.7679 1323.3547 1342.0985 1354.2405 1373.0563 1376.9255 1382.8446 1388.3602 1395.6536 1405.3776 1434.8267 1453.4854 1454.5281 1458.4588 1462.7347 1464.9404 1468.5328 1469.5151 1474.4951 1476.8291 1484.0077 1486.3864 1489.5883 1572.7380 1608.3511 1617.2849 2963.9162 2973.0840 2976.0116 2977.8105 2980.9743 2985.8321 2986.9283 2989.2130 3015.3245 3029.3521 3032.6940 3040.5149 3066.7151 3067.6179 3071.9093 3072.0931 3073.0421 3078.2180 3080.6074 3084.2126 3087.3963 3125.6948
redmass: 3.1433 3.6758 2.0289 2.9516 1.1162 2.4070 1.8071 1.7048 2.2196 1.5211 2.2064 2.9143 1.8368 1.3607 2.8684 3.0739 2.8314 2.5181 2.9218 2.8224 3.5969 2.8627 3.1496 3.6995 3.4221 2.6975 3.7078 3.6885 3.9540 5.9044 3.2599 2.4977 4.8922 2.4915 2.5251 2.1176 2.1584 1.6375 1.8464 2.9864 1.5062 1.6075 1.7887 3.6799 2.0966 1.9521 1.6760 1.4274 2.6886 1.6907 1.5858 1.7272 2.4342 1.6351 1.2251 2.1919 2.1441 1.4732 1.6103 2.1812 2.3644 1.7184 1.7286 1.7615 1.8506 1.3993 2.9252 1.9776 1.4499 1.5026 1.1889 4.9700 1.5556 1.8611 1.3010 1.2867 1.1119 1.0467 1.0778 1.1438 1.0648 1.2163 1.2080 1.2780 1.2440 1.1118 1.1645 1.1516 1.0744 8.6699 7.4902 10.8389 1.0791 1.0352 1.0425 1.0365 1.0537 1.0367 1.0609 1.0639 1.0621 1.0996 1.0999 1.1026 1.0995 1.0959 1.0995 1.1007 1.0993 1.0996 1.0989 1.0987 1.1013 1.0894
irintensity: 0.0837 1.1736 2.2274 0.1141 1.6762 3.0825 0.3260 0.5540 0.9666 0.0987 0.3490 2.4107 1.0483 0.6272 0.1034 0.7968 0.0937 0.2575 2.1252 0.9040 0.9536 0.1476 2.8037 2.2589 2.4279 0.4947 0.8754 0.7966 5.3695 8.7014 2.4701 2.1924 1.8283 6.1680 1.3637 2.9452 0.8949 6.9449 4.1279 6.8994 1.5606 1.3721 7.0911 12.0022 0.4450 0.3443 16.2407 0.5499 4.6311 26.5011 8.1749 1.1045 35.0049 10.2777 0.5257 19.1397 0.7354 4.5354 4.3834 3.1904 12.1203 1.2190 1.1282 59.1647 29.5162 2.0517 1.8964 2.7665 4.4674 2.8570 15.3588 0.8188 14.4416 20.6888 13.5489 14.3054 10.6826 11.6111 0.1010 12.3102 4.8573 1.2329 13.3668 27.2014 11.9439 5.8912 21.7827 14.5325 17.0901 148.2995 96.4000 212.9903 14.2336 27.4709 3.9851 36.6449 70.8089 27.5633 16.5930 60.0110 15.8220 41.2104 8.2213 55.5077 7.6381 12.1530 44.7981 31.9871 54.4793 22.3106 35.3114 37.8095 20.7577 24.3760
temp: 298.150 k
press: 1.00000 atm
elementType: 8 6 6 6 6 6 6 6 6 6 6 6 6 6 6 6 6 6 1 1 1 1 1 1 1 1 1 1 1 1 1 1 1 1 1 1 1 1 1 1
symmnumber: 1
zpe: 901684.2 jmol-1
zpe.correction: 0.343433 hartree
zpe.thermalcorrener: 0.361148 hartree
zpe.thermalcorrenthalpy: 0.362093 hartree
zpe.thermalcorrgfe: 0.299080 hartree
zpe.sumelectzpe: -734.918353 hartree
zpe.sumelectthermal: -734.900638 hartree
zpe.sumelectthermalent: -734.899694 hartree
zpe.sumelectthermalfe: -734.962707 hartree
dipole: -4.1457 1.8146 0.2586
dipole: 4.5328
quadrupole: -123.6967 -100.6549 -109.0293
quadrupole: 7.1743 0.3626 0.8777
quadrupole: -12.5698 10.4721 2.0977 7.1743 0.3626 0.8777
hfenergy: -735.2617866 hartree
pointgroup: C01 [X(C17H22O1)]
dipole: 1.6336187 -0.7065944 0.1109564 debye
polarizability: 238.1289728|0.1475932|197.2649613|2.0916536|-1.255266|121.3899135 unknown
InChI: InChI=1S/C17H22O/c1-10-7-8-17(3,4)13-9-11(2)16-12(15(10)13)5-6-14(16)18/h9-10H,5-8H2,1-4H3
charge 0 multiplicity 1
40 atoms
O  -4.267238 0.574148 -0.074423
C  2.507476 0.918838 0.086571
C  1.344609 -1.937302 0.132088
C  3.347692 -0.385745 -0.051792
C  0.454808 -0.694475 0.055261
C  0.990142 0.629573 -0.007315
C  2.73739 -1.580078 0.705144
C  -0.955921 -0.833656 0.046766
C  2.963955 1.8968 -1.034877
C  2.79805 1.57561 1.472891
C  -1.817446 0.28775 -0.042312
C  -1.757048 -2.131072 0.159837
C  0.099859 1.740377 -0.096181
C  1.462667 -2.637707 -1.25353
C  -1.303658 1.614043 -0.126106
C  -3.245377 -1.687874 0.133349
C  -3.233522 -0.150769 -0.008061
C  -2.207395 2.824881 -0.227972
H  0.86182 -2.662721 0.81918
H  4.373311 -0.181862 0.312772
H  3.44428 -0.643442 -1.124764
H  3.406366 -2.459472 0.632137
H  2.644382 -1.335951 1.781743
H  2.684066 1.514275 -2.033392
H  2.525868 2.903752 -0.919648
H  4.064419 2.008459 -1.004347
H  2.561142 0.886947 2.30376
H  3.867115 1.85162 1.54447
H  2.195772 2.490604 1.616022
H  -1.525025 -2.824761 -0.669239
H  -1.506023 -2.671532 1.092882
H  0.522006 2.751092 -0.140764
H  2.051618 -3.569772 -1.165568
H  0.47106 -2.89903 -1.663231
H  1.960215 -1.985087 -1.992602
H  -3.791676 -1.959588 1.054753
H  -3.810289 -2.124844 -0.709741
H  -1.618337 3.757993 -0.247562
H  -2.83421 2.780339 -1.137002
H  -2.91902 2.865536 0.615902
