program: Gaussian 09
title: 000227643
version: EM64L-G09RevD.01
frameworkgroup: C1[X(C17H22O)]
method: RPBEPBE
basis: SDD
operation: Freq
keyword: #pfreq=noraman
keyword: PBEPBE/SDD
title: #p freq=noraman PBEPBE/SDD
converged: YES YES NO NO
title: Mulliken charges:
elementType: O C C C C C C C C C C C C C C C C C H H H H H H H H H H H H H H H H H H H H H H
charge: -0.225998 0.220275 0.166070 -0.447175 0.336899 0.085281 -0.454137 -0.565161 -0.041278 -0.530389 -0.780418 -0.753997 0.452901 -0.676965 -0.544119 0.009124 -0.529612 -0.694013 0.205014 0.203507 0.209294 0.211748 0.224734 0.230055 0.248689 0.228524 0.238540 0.225071 0.216921 0.217365 0.216321 0.228185 0.241984 0.249352 0.249174 0.204315 0.247256 0.251432 0.216474 0.208754
chargesum: 0.00000
title: Mulliken charges with hydrogens summed into heavy atoms:
elementType: O C C C C C C C C C C C C C C C C C
charge: -0.225998 0.220275 0.166070 -0.038653 0.336899 0.085281 -0.033095 -0.110372 -0.041278 -0.053176 -0.099885 -0.092125 0.452901 -0.434981 -0.045593 0.009124 -0.078041 -0.017353
polarizability: 2.35941546e+02 4.25787921e+00 1.98681893e+02 -4.53838997e-01 3.84010016e+00 1.21070405e+02
1716.lowfreq: -13.2125 -6.8089 -0.0005 -0.0005 -0.0004 11.7639 46.4071 61.6830 79.3223
frequency: 46.3783 61.5390 79.2624 86.5855 112.8575 131.6501 175.6301 199.5135 203.0522 221.4185 235.7653 253.8414 262.7388 282.3384 291.8959 301.4375 319.8163 365.9704 382.1953 428.5189 462.9174 482.1378 494.1190 513.2208 521.2867 531.9930 568.9449 618.3236 639.5940 660.7160 686.3522 734.5091 759.7157 790.4201 835.8740 845.9300 859.5171 884.9209 911.3848 916.8946 926.4971 931.1263 954.7122 991.1246 994.9639 998.9682 1011.3378 1033.7795 1041.7593 1054.9373 1065.3867 1082.6631 1096.9076 1121.9831 1137.1902 1155.4769 1190.7299 1193.5674 1205.1058 1217.8606 1233.1051 1242.1209 1249.2109 1271.2862 1279.4365 1286.6692 1294.6812 1316.0179 1332.5691 1342.9222 1350.7607 1375.3389 1378.3680 1380.7404 1391.9486 1395.3196 1435.8746 1446.5864 1455.6701 1462.4600 1463.8687 1468.5122 1468.9783 1473.9996 1474.6192 1479.4645 1486.2306 1489.0143 1496.6139 1568.1835 1600.1014 1613.9819 2953.3697 2965.0477 2976.9863 2980.9625 2982.8207 2989.6180 2993.0591 3001.4943 3010.8528 3022.1998 3029.5470 3048.2270 3052.8174 3058.6894 3064.2099 3071.5714 3075.5640 3079.1521 3085.7172 3097.2607 3103.7721 3105.8309
redmass: 3.1352 3.4276 2.5270 3.3503 2.2055 2.8151 1.5963 1.2202 2.9855 1.4187 2.6601 1.9394 2.5825 2.0544 2.1071 2.8819 2.9419 2.8930 2.4017 3.0821 3.4861 3.0612 2.8325 3.6159 3.7394 3.7233 2.5898 3.0920 3.4808 6.0834 4.8889 2.9606 2.5749 1.2114 2.4036 1.9265 1.7964 2.1640 1.6132 2.3990 2.4596 1.6492 2.2802 1.9134 2.1004 1.5468 2.6697 2.5468 1.8580 2.6021 1.7425 1.9412 1.8769 1.5042 1.2018 1.8755 2.1051 1.9739 1.6467 1.4423 1.6307 1.7675 1.4710 1.8471 1.4811 1.8070 2.0030 1.6230 1.9472 1.4372 1.5946 3.8379 1.2098 1.3349 3.1462 1.2171 1.1149 1.3028 1.0950 1.2818 1.0832 1.0609 1.4711 1.0718 1.1184 1.1048 1.0803 1.0754 1.0684 8.0379 7.2043 11.2571 1.0656 1.0615 1.0366 1.0384 1.0354 1.0628 1.0620 1.0596 1.0656 1.0948 1.0959 1.1033 1.0995 1.0987 1.0989 1.0981 1.0999 1.0999 1.0980 1.1007 1.0906 1.0966
irintensity: 0.0737 1.5975 1.4143 3.7717 0.4685 0.2343 0.6817 0.2873 1.4613 0.6698 0.4045 0.2423 2.6207 1.1911 0.6464 0.3467 1.2945 0.5304 0.4567 1.7633 2.8266 0.9818 1.4974 2.0946 2.9350 0.3563 0.2606 6.9174 0.3569 5.1041 4.4045 3.5011 2.2822 3.6206 7.4658 3.8370 2.1257 0.8597 17.5701 6.3790 3.8473 0.6362 4.0567 2.6841 2.6793 5.4988 24.5049 0.6344 1.3485 3.6082 25.9261 17.1200 1.9957 2.0249 0.4783 29.6356 2.9659 28.4633 3.4743 3.5639 9.9604 12.1647 5.3061 6.2192 14.1516 22.4600 33.2668 1.9325 0.2335 2.5992 1.8061 4.0236 20.7299 12.9008 6.1485 13.0195 16.1617 5.5711 4.0393 2.1613 11.6639 3.2168 21.6317 6.6761 30.0654 12.7534 10.7281 11.8190 11.2177 113.5012 42.5359 265.8944 20.5982 30.7935 27.2730 51.1688 39.0545 35.7738 37.2676 29.3967 12.1117 33.1490 57.0343 52.3801 10.2269 5.1430 25.9659 59.4640 19.2530 43.3478 23.8571 22.7147 26.4744 33.3169
temp: 298.150 k
press: 1.00000 atm
elementType: 8 6 6 6 6 6 6 6 6 6 6 6 6 6 6 6 6 6 1 1 1 1 1 1 1 1 1 1 1 1 1 1 1 1 1 1 1 1 1 1
symmnumber: 1
zpe: 905098.6 jmol-1
zpe.correction: 0.344734 hartree
zpe.thermalcorrener: 0.362018 hartree
zpe.thermalcorrenthalpy: 0.362962 hartree
zpe.thermalcorrgfe: 0.300842 hartree
zpe.sumelectzpe: -734.912521 hartree
zpe.sumelectthermal: -734.895237 hartree
zpe.sumelectthermalent: -734.894293 hartree
zpe.sumelectthermalfe: -734.956413 hartree
dipole: -4.5212 -0.4105 0.2488
dipole: 4.5466
quadrupole: -120.8406 -99.9417 -109.2742
quadrupole: -3.9571 1.2097 1.3376
quadrupole: -10.8218 10.0772 0.7446 -3.9571 1.2097 1.3376
hfenergy: -735.257255 hartree
pointgroup: C01 [X(C17H22O1)]
dipole: 1.7846525 -0.0968463 -0.0728382 debye
polarizability: 236.1930027|-2.802227|198.2824262|1.252195|-5.0652826|121.2184141 unknown
InChI: InChI=1S/C17H22O/c1-4-11-10-12-6-5-9-17(2,3)16(12)13-7-8-14(18)15(11)13/h10H,4-9H2,1-3H3
charge 0 multiplicity 1
40 atoms
O  -3.773815 1.081458 0.118881
C  2.443751 0.731381 -0.062283
C  1.034372 0.092903 0.094736
C  3.569139 -0.288481 0.302803
C  0.877474 -1.324142 0.241646
C  -0.168464 0.858181 0.050828
C  3.349492 -1.68824 -0.292741
C  2.064794 -2.281057 0.307813
C  -1.450302 0.241878 0.138509
C  -0.334324 2.381359 -0.052289
C  2.659811 1.95772 0.874448
C  2.641696 1.178508 -1.544509
C  -1.606403 -1.164113 0.303778
C  -0.413637 -1.908829 0.352863
C  -1.855537 2.622468 -0.218073
C  -2.52449 1.262023 0.036581
C  -2.960486 -1.848793 0.382749
C  -3.600171 -2.060354 -1.016757
H  3.628007 -0.380277 1.407499
H  4.535215 0.135513 -0.034109
H  4.212335 -2.343272 -0.068436
H  3.266318 -1.631758 -1.395172
H  2.254304 -2.537267 1.372193
H  1.795155 -3.231328 -0.190867
H  0.029497 2.863245 0.873077
H  0.247805 2.816534 -0.88315
H  2.136047 2.861039 0.525121
H  2.329092 1.736293 1.905764
H  3.738936 2.201003 0.909526
H  1.855989 1.882766 -1.86872
H  3.619379 1.683983 -1.661349
H  2.614476 0.314847 -2.232278
H  -0.478292 -2.998619 0.474194
H  -2.116074 2.947933 -1.243087
H  -2.263353 3.382836 0.470337
H  -2.839083 -2.830387 0.879743
H  -3.655409 -1.24018 0.987132
H  -3.799913 -1.088408 -1.49904
H  -4.563422 -2.593869 -0.921359
H  -2.938411 -2.653496 -1.674397
