program: Gaussian 09
title: 000227637
version: EM64L-G09RevD.01
frameworkgroup: C1[X(C15H18O2)]
method: RPBEPBE
basis: SDD
operation: Freq
keyword: #pfreq=noraman
keyword: PBEPBE/SDD
title: #p freq=noraman PBEPBE/SDD
converged: NO YES NO NO
title: Mulliken charges:
elementType: O O C C C C C C C C C C C C C C C H H H H H H H H H H H H H H H H H H
charge: -0.274539 -0.209545 0.170096 0.340306 0.025621 -0.749349 -0.723493 -0.723474 0.112498 -0.395087 0.369415 -0.499166 0.384279 -0.835969 -0.482451 0.119941 -0.795692 0.223793 0.214018 0.213994 0.207713 0.206110 0.271768 0.206113 0.207720 0.271732 0.262135 0.228661 0.226667 0.226680 0.246690 0.249244 0.239452 0.232066 0.232054
chargesum: 0.00000
title: Mulliken charges with hydrogens summed into heavy atoms:
elementType: O O C C C C C C C C C C C C C C C
charge: -0.274539 -0.209545 0.170096 0.340306 0.025621 -0.097544 -0.037901 -0.037909 0.112498 -0.132952 0.369415 -0.270505 0.384279 -0.135933 -0.233207 0.119941 -0.092120
polarizability: 2.08354290e+02 2.19807840e-01 2.15450910e+02 3.52343316e-03 -4.41703164e-03 9.89381808e+01
1716.lowfreq: -4.1826 0.0003 0.0007 0.0009 8.8409 15.0382 35.1209 66.5731 83.6549
frequency: 35.0911 66.4573 83.4980 118.5518 131.6189 155.6333 176.9888 201.4565 244.7353 246.4589 260.2377 279.3493 279.7178 327.1543 330.9109 331.3990 334.0890 358.3568 375.1558 407.0549 417.4685 450.0028 487.3435 489.4825 519.3121 551.5187 580.6854 610.8298 628.9561 675.4063 690.7311 691.0508 777.1208 801.8458 836.1585 837.4207 868.3530 872.2052 921.1412 934.7775 949.2877 962.0572 965.3826 1007.3007 1025.0345 1029.7256 1031.1312 1038.1148 1048.0705 1092.4367 1144.6551 1170.4424 1203.6696 1215.8590 1222.6094 1234.8708 1262.1044 1277.3992 1341.2229 1356.1347 1372.0867 1374.5476 1386.7896 1395.4745 1403.1148 1408.1139 1453.4603 1457.1185 1459.9660 1465.6012 1473.0391 1477.8987 1479.8599 1491.0094 1494.7739 1499.1212 1505.9293 1566.6441 1577.3073 1604.7699 1685.6859 2969.9921 2978.4571 2982.0249 2991.1298 3001.4458 3062.7598 3066.3863 3067.0126 3075.2520 3076.1479 3086.1126 3090.0495 3100.9012 3115.6709 3118.3687 3133.9286 3168.8348 3180.0024
redmass: 3.7610 3.0361 3.2199 2.0306 1.6857 4.9442 3.2270 1.2058 1.0803 2.3111 3.0570 2.8379 4.6122 1.0630 1.1086 3.3096 3.2585 2.1890 4.3585 3.5800 2.8603 4.9800 4.0795 3.0835 5.4934 4.0979 3.5318 4.0889 4.1985 5.4001 4.4228 6.3130 5.2495 3.8228 1.3336 7.6067 3.5405 1.3935 1.6986 1.6923 1.2298 1.3541 2.4040 1.4940 1.4381 1.5509 1.3740 2.0965 1.5949 4.2418 5.4984 1.8050 3.0018 3.3014 2.1309 2.1613 2.1903 2.0744 2.4669 6.3732 1.1980 1.1792 1.4774 2.0501 1.2943 1.3006 1.3592 1.0483 1.0494 1.6084 1.2547 1.0478 1.0669 1.0510 1.0482 1.1134 1.0660 4.9783 6.4939 7.2374 10.1662 1.0355 1.0370 1.0378 1.0371 1.0364 1.1003 1.0993 1.0999 1.0979 1.0980 1.0991 1.0967 1.0990 1.0977 1.0971 1.0896 1.0918 1.0926
irintensity: 2.1287 0.8278 0.2852 0.0302 0.2255 2.0822 0.8525 0.1422 0.0842 3.6442 0.3129 0.7396 2.5495 0.0835 0.3031 0.0372 0.4340 0.4600 1.0723 6.0971 0.0125 0.1294 0.4609 1.9824 2.3301 3.7832 0.1183 4.4909 9.7064 5.0128 0.1299 0.2162 5.3995 1.5867 20.4829 61.5015 18.0701 28.6373 2.3361 5.2014 0.4665 0.2997 31.2126 1.1434 3.6123 0.0010 0.4633 41.7246 14.6974 13.6724 37.2589 9.7586 5.9802 11.4758 6.7749 45.5363 0.9605 15.8466 11.9036 1.9431 20.7689 23.6211 11.1994 57.5250 4.3285 42.2727 103.3502 0.1301 0.9295 5.7199 4.5093 0.1608 7.9491 10.9814 35.0718 0.2567 22.1653 6.4297 51.2028 20.7919 542.7857 21.7819 44.2836 43.8546 18.5140 30.6173 0.1584 14.6262 55.2770 7.7781 87.0020 32.4331 22.1430 12.3824 0.5162 21.3179 18.8277 3.9882 10.2649
temp: 298.150 k
press: 1.00000 atm
elementType: 8 8 6 6 6 6 6 6 6 6 6 6 6 6 6 6 6 1 1 1 1 1 1 1 1 1 1 1 1 1 1 1 1 1 1
symmnumber: 1
zpe: 761184.0 jmol-1
zpe.correction: 0.289920 hartree
zpe.thermalcorrener: 0.306604 hartree
zpe.thermalcorrenthalpy: 0.307548 hartree
zpe.thermalcorrgfe: 0.246969 hartree
zpe.sumelectzpe: -731.597446 hartree
zpe.sumelectthermal: -731.580762 hartree
zpe.sumelectthermalent: -731.579817 hartree
zpe.sumelectthermalfe: -731.640397 hartree
dipole: 2.5961 -5.2705 0.0010
dipole: 5.8752
quadrupole: -84.6946 -113.8573 -104.1285
quadrupole: 0.7177 0.0016 0.0056
quadrupole: 16.1989 -12.9639 -3.2351 0.7177 0.0016 0.0056
hfenergy: -731.8873654 hartree
pointgroup: C01 [X(C15H18O2)]
dipole: 0.8282364 -2.1579633 0.0125525 debye
polarizability: 208.4498815|0.8620984|215.350646|0.5879197|-0.4154174|98.9428526 unknown
InChI: InChI=1S/C15H18O2/c1-9-6-7-11(15(3,4)5)14-13(9)10(2)8-12(16)17-14/h6-8H,1-5H3
charge 0 multiplicity 1
35 atoms
O  -0.204809 1.487399 -0.010253
O  0.67862 3.61098 -0.01347
C  -2.70251 0.101772 -0.018423
C  -1.327511 -0.613738 -0.008579
C  -0.083712 0.089362 -0.004432
C  -3.871069 -0.922317 -0.02105
C  -2.847455 0.979715 -1.299934
C  -2.860922 0.988437 1.25547
C  1.213239 -0.541163 0.004816
C  -1.222545 -2.01894 -0.002889
C  1.252035 -1.98518 0.010016
C  0.026433 -2.678623 0.006036
C  2.387317 0.353498 0.00816
C  2.512515 -2.841329 0.019001
C  2.212651 1.726907 0.002037
C  0.923127 2.386852 -0.007677
C  3.823343 -0.140149 0.018531
H  -4.827579 -0.369423 -0.027766
H  -3.856517 -1.569676 -0.917879
H  -3.865655 -1.563726 0.880138
H  -2.75704 0.360974 -2.212362
H  -3.845539 1.456598 -1.307787
H  -2.086014 1.773486 -1.333782
H  -3.85907 1.465211 1.249657
H  -2.779976 0.376005 2.173031
H  -2.099947 1.782548 1.2918
H  -2.130017 -2.626896 -0.005498
H  0.043331 -3.774063 0.009926
H  3.146759 -2.675047 -0.8691
H  3.138807 -2.668722 0.911512
H  2.229838 -3.907199 0.021527
H  3.075803 2.398053 0.004455
H  4.51497 0.717953 0.018704
H  4.054217 -0.757089 -0.866587
H  4.043882 -0.749067 0.911848
