program: Gaussian 09
title: 000227627
version: EM64L-G09RevD.01
frameworkgroup: C1[X(C11H12O2)]
method: RPBEPBE
basis: SDD
operation: Freq
keyword: #pfreq=noraman
keyword: PBEPBE/SDD
title: #p freq=noraman PBEPBE/SDD
converged: YES YES NO NO
title: Mulliken charges:
elementType: O O C C C C C C C C C C C H H H H H H H H H H H H
charge: -0.241517 -0.177538 -0.188954 -0.571296 -0.370308 0.388282 0.122895 0.166070 -0.689590 -0.415796 -0.359564 -0.241730 -0.214255 0.242893 0.245130 0.231819 0.229462 0.207943 0.242928 0.211932 0.216586 0.237228 0.262280 0.230784 0.234316
chargesum: 0.00000
title: Mulliken charges with hydrogens summed into heavy atoms:
elementType: O O C C C C C C C C C C C
charge: -0.241517 -0.177538 0.053939 -0.094347 0.067097 0.388282 0.122895 0.166070 -0.018144 -0.178568 -0.097284 -0.010947 0.020061
polarizability: 1.59989743e+02 -8.13540869e+00 1.12719085e+02 1.49852503e+01 1.11527779e+01 8.44488150e+01
1716.lowfreq: -19.2329 -12.3846 -6.9907 -0.0009 -0.0004 0.0003 55.7496 69.7180 87.8716
frequency: 55.7344 69.6400 87.8646 148.3592 190.7831 228.7358 256.7295 284.2527 313.5891 348.5893 421.7555 449.9099 467.6025 519.9952 531.4010 581.0107 662.8984 688.9629 697.8377 736.2308 765.4640 776.0976 817.5627 840.6606 870.4884 883.1462 932.9993 953.5845 983.9326 1003.6833 1020.4824 1035.7017 1064.8635 1092.6537 1098.8768 1136.5931 1168.6465 1173.5856 1213.0024 1223.1997 1239.9859 1255.8762 1283.3896 1314.6197 1326.4576 1352.8334 1388.5956 1400.5262 1441.2730 1456.3500 1469.3588 1476.3191 1478.1299 1482.4836 1592.0018 1618.5277 1683.9922 2972.4838 2980.8457 2985.6921 3029.8507 3043.5281 3048.8902 3080.7567 3087.3702 3124.4780 3142.0554 3160.1831 3175.7929
redmass: 3.1193 4.2634 2.4251 3.5771 2.1727 1.8424 3.2474 3.3775 3.0585 3.3403 4.0841 4.3548 5.1260 5.1623 3.5982 5.7464 5.1110 3.9480 3.6250 4.1162 1.3612 1.8385 2.3025 2.2498 1.4243 4.3542 1.6410 1.5346 1.3194 2.3850 2.1300 1.7375 2.9200 1.7977 2.2153 2.4138 1.0783 2.3080 1.4403 2.5524 1.3579 1.2999 1.4250 1.3433 1.3710 1.5924 6.6673 1.2055 2.2016 1.1951 1.0662 1.0756 2.2384 1.0747 6.7387 7.5225 11.3861 1.0647 1.0586 1.0382 1.0949 1.0968 1.0914 1.0997 1.1003 1.0880 1.0891 1.0947 1.0992
irintensity: 0.2965 0.1120 1.4027 0.1536 4.4682 0.4856 1.3777 1.8694 0.9314 0.2870 1.3113 4.4798 12.5274 0.3351 0.3074 6.2940 3.1982 0.8205 3.4175 4.7292 78.7231 14.4895 16.8413 41.6853 6.8944 14.2697 55.9899 49.0293 0.3200 48.1696 13.6577 41.3572 52.7206 11.4907 38.3521 145.2496 0.3673 36.5331 26.2955 27.6287 0.7371 6.2059 6.0157 2.2847 2.3385 6.2957 1.0568 17.3771 42.4477 14.4590 0.9437 13.8866 46.4654 10.5350 13.1802 27.6811 296.2232 24.6100 26.8864 23.1131 2.4758 14.3939 27.2084 40.7417 38.2268 5.7322 10.3817 21.0463 10.7404
temp: 298.150 k
press: 1.00000 atm
elementType: 8 8 6 6 6 6 6 6 6 6 6 6 6 1 1 1 1 1 1 1 1 1 1 1 1
symmnumber: 1
zpe: 531678.8 jmol-1
zpe.correction: 0.202506 hartree
zpe.thermalcorrener: 0.213942 hartree
zpe.thermalcorrenthalpy: 0.214886 hartree
zpe.thermalcorrgfe: 0.164894 hartree
zpe.sumelectzpe: -575.877525 hartree
zpe.sumelectthermal: -575.866089 hartree
zpe.sumelectthermalent: -575.865145 hartree
zpe.sumelectthermalfe: -575.915137 hartree
dipole: 2.1981 -4.0531 0.3881
dipole: 4.6271
quadrupole: -76.0583 -78.5994 -75.5610
quadrupole: 7.9383 0.3371 5.2398
quadrupole: 0.6812 -1.8598 1.1786 7.9383 0.3371 5.2398
hfenergy: -576.080031 hartree
pointgroup: C01 [X(C11H12O2)]
dipole: -0.8721932 1.5860538 0.1942157 debye
dipolederiv: -1.8669701 0.2699267 0.2615477 -0.1407248 -0.3992334 0.0024773 0.4492473 -0.0708643 -0.2548773 -1.1536413 0.2636132 0.1693291 0.4433755 -0.6811143 -0.132648 0.2156389 -0.0652201 -0.3388268 0.0327313 0.0260827 -0.0331249 -0.048737 -0.2082631 -0.0430948 -0.0259976 -0.0967018 0.0317816 0.0041907 -0.0065751 0.0081143 -0.0045619 0.1128968 0.0004298 0.0409462 0.0483487 0.0795409 0.086279 0.0423064 0.0018981 0.0578071 0.1111151 -0.0021314 0.0468471 0.0935085 0.1370693 -0.0475742 0.069536 -0.0651658 0.2619115 -0.1049093 -0.0445101 -0.1886994 -0.0385594 -0.011469 2.1756584 -0.2779277 -0.3777443 0.1889635 0.9363833 0.1226978 -0.6130169 0.0901131 0.2480457 0.9805568 -0.2922664 -0.1152276 -0.6027812 0.2422412 0.0827477 -0.1237484 0.0613693 0.0982083 -0.0037489 0.0292201 -0.0610423 0.0227417 0.0403064 -0.0053213 -0.0913167 0.0044117 0.0205826 -0.0191545 -0.0430402 -0.0347749 -0.0666343 0.0764075 -0.0828376 -0.0095021 -0.0827421 -0.100795 -0.2652664 0.0564911 -0.0085257 -0.01181 0.0221107 -0.0588821 0.0365993 -0.0846289 -0.1328031 -0.0244045 -0.0825871 -0.0363021 -0.079289 -0.0674238 -0.0056326 -0.0143789 -0.0033286 -0.1518998 0.0602377 -0.0141801 -0.0786907 0.0280706 0.0236972 -0.08124 -0.0949571 -0.0696146 -0.096651 -0.0840684 -0.0372848 0.0956169 -0.0377288 0.0498951 0.012778 0.0629405 0.0221282 0.0180465 -0.0095133 -0.0323324 0.0161561 -0.0102753 0.0844634 -0.0551977 0.0093421 -0.0073378 -0.1357931 0.0319338 0.023424 0.0079293 -0.0187218 -0.1407302 0.0293616 0.0085032 -0.031823 0.1023285 -0.0803756 -0.0239007 0.0867308 -0.0399433 0.0528033 0.0387821 0.0849668 0.0171129 -0.00819 0.0524518 0.0344791 -0.0302985 0.012013 -0.1708204 0.0093915 -0.0382367 0.0170338 0.0316877 0.076208 -0.0128216 -0.0030647 0.0284204 -0.1164074 0.047654 0.0298257 0.0148629 0.1039033 -0.078148 -0.0422186 0.066394 -0.0428313 0.0690515 0.0492519 0.1431771 0.0572464 -0.0032229 0.0504875 -0.0057554 -0.0388252 -0.0322374 0.0544054 -0.1069346 -0.0930297 -0.1009458 -0.1328347 0.087142 -0.0107143 0.0260402 0.0309951 -0.0759897 0.0818795 0.0067717 0.0856074 0.1083707 0.109088 0.0344429 0.0107644 0.0204327 -0.0165061 0.0676364 0.0156785 0.0647914 0.1389345 -0.0711061 0.0915671 0.0413185 0.1035892 0.0447863 0.0118186 0.0430884 0.0133422 0.1463175 -0.0429938 -0.0594848 0.0909473 -0.0620442 0.0608347 0.0615238 0.0993107 0.0618898 0.1025455 unknown
polarizability: 159.9733817|-7.5644204|113.1697632|-15.3590552|-10.5026281|84.0144987 unknown
InChI: InChI=1S/C11H12O2/c1-2-8-7-9-5-3-4-6-10(9)13-11(8)12/h3-6,8H,2,7H2,1H3
charge 0 multiplicity 1
25 atoms
O  0.406335 -1.481907 -0.182747
O  2.614122 -1.630319 -0.75326
C  1.670888 0.649525 -0.588649
C  0.368244 1.192986 -1.233774
C  1.903234 1.227685 0.844245
C  -0.852984 0.623064 -0.53657
C  1.648923 -0.87799 -0.545449
C  -0.774453 -0.694351 -0.025519
C  3.244164 0.802461 1.477189
C  -2.072053 1.319851 -0.377136
C  -1.859535 -1.320778 0.615858
C  -3.177609 0.714034 0.26295
C  -3.069531 -0.607154 0.758762
H  2.542731 0.921516 -1.21073
H  0.348181 0.916386 -2.308104
H  0.365929 2.297369 -1.187908
H  1.062974 0.940136 1.504825
H  1.86827 2.331838 0.754398
H  3.305723 -0.292215 1.608421
H  4.098938 1.107818 0.845824
H  3.369702 1.271157 2.469856
H  -2.153843 2.34433 -0.759998
H  -1.744383 -2.343678 0.986364
H  -4.115447 1.267878 0.376024
H  -3.922619 -1.081142 1.255526
