program: Gaussian 09
title: 000227620
version: EM64L-G09RevD.01
frameworkgroup: C1[X(C10H18O2)]
method: RPBEPBE
basis: SDD
operation: Freq
keyword: #pfreq=noraman
keyword: PBEPBE/SDD
title: #p freq=noraman PBEPBE/SDD
converged: YES YES NO NO
title: Mulliken charges:
elementType: O O C C C C C C C C C C H H H H H H H H H H H H H H H H H H
charge: -0.192895 -0.218244 -0.000844 -0.060177 -0.432501 -0.506923 -0.516306 -0.725596 -0.718690 -0.092308 0.240399 -0.768269 0.220490 0.186466 0.231929 0.204883 0.224383 0.243365 0.237587 0.232718 0.216174 0.214125 0.223551 0.215934 0.216450 0.206913 0.188494 0.256616 0.229658 0.242615
chargesum: 0.00000
title: Mulliken charges with hydrogens summed into heavy atoms:
elementType: O O C C C C C C C C C C
charge: -0.192895 -0.218244 0.219646 0.126289 0.004312 -0.039175 -0.046001 -0.071746 -0.079393 0.096187 0.240399 -0.039380
polarizability: 1.18941537e+02 2.65289210e+00 1.18532897e+02 -1.41614665e+00 1.05490180e+00 9.70148217e+01
1716.lowfreq: -10.8988 -5.4453 -0.0004 -0.0003 0.0002 9.9735 28.4107 39.3017 47.3242
frequency: 26.9145 38.9023 47.3099 58.1849 71.2750 79.8879 93.0229 171.1679 184.0029 202.3129 239.1250 243.3401 268.4401 277.9838 339.2796 374.8865 436.1318 449.6721 462.5517 487.6885 560.5087 599.6340 701.7272 736.2938 791.0258 809.7818 894.3096 905.5769 916.9275 945.4323 953.9174 972.8930 997.6635 1009.4057 1033.2485 1065.5208 1097.5280 1120.8334 1146.0463 1169.5386 1181.9208 1186.6004 1205.0718 1235.4822 1243.3410 1301.7277 1312.5498 1331.5269 1338.9489 1345.9990 1368.9119 1372.2160 1377.2418 1393.0483 1397.8538 1426.2394 1430.3749 1443.2596 1456.0818 1459.0404 1465.3635 1476.1562 1484.5985 1489.5428 1632.1745 1639.1318 2890.1917 2951.1952 2958.2895 2961.7747 2969.4480 2974.0326 2977.7494 2981.6673 2987.5175 3007.9982 3041.8136 3054.9740 3061.2319 3067.3535 3067.6478 3071.1699 3071.6399 3120.8101
redmass: 4.3897 2.6846 3.2362 2.2510 1.6051 2.7494 2.7970 3.0846 3.4393 1.1024 1.9283 1.1996 2.7428 2.4237 2.5515 2.1801 2.0889 2.5916 2.5895 3.0824 2.8739 2.9565 2.0364 2.1483 2.3454 1.7864 1.7177 1.2900 1.5391 1.8208 1.4476 1.9725 2.0036 1.6500 2.4519 2.0185 2.5255 2.3253 2.0727 1.6712 1.7977 1.7103 1.4854 1.3439 1.3270 1.3513 1.3922 1.4873 1.4881 1.4576 1.2455 1.4028 1.2098 1.1977 1.2131 1.0873 1.0864 1.0728 1.0586 1.0820 1.0455 1.0534 1.0451 1.0558 7.4087 7.7105 1.0857 1.0820 1.0638 1.0606 1.0360 1.0591 1.0560 1.0386 1.0670 1.0920 1.1012 1.0951 1.0988 1.0950 1.0995 1.0987 1.0987 1.1004
irintensity: 1.1059 2.6303 5.8927 3.1525 0.3254 2.5792 6.6727 2.5207 4.3968 0.1842 0.6362 0.6737 0.8742 2.6239 1.1488 0.9349 1.1850 5.3787 0.2671 7.1754 21.5564 3.3645 1.8610 5.2815 3.2639 1.5813 0.6702 2.7384 2.8144 2.9244 2.3122 15.1344 6.7329 5.6806 32.5532 3.9176 0.1776 5.8010 16.6692 44.7405 5.7936 15.9777 17.6373 12.1916 9.8159 11.3862 0.4988 10.3559 18.5076 14.0198 59.5293 5.2423 20.8492 8.4038 11.2072 23.1830 12.5269 26.7698 15.1848 11.0112 1.7787 8.3031 15.6613 15.1909 101.3853 163.5309 72.5174 35.3789 19.7156 18.6866 33.0259 28.3255 4.5592 8.0616 24.8548 24.1667 22.7606 23.9247 21.8560 12.7386 26.4008 59.8735 72.9226 11.9602
temp: 298.150 k
press: 1.00000 atm
elementType: 8 8 6 6 6 6 6 6 6 6 6 6 1 1 1 1 1 1 1 1 1 1 1 1 1 1 1 1 1 1
symmnumber: 1
zpe: 677031.3 jmol-1
zpe.correction: 0.257868 hartree
zpe.thermalcorrener: 0.273257 hartree
zpe.thermalcorrenthalpy: 0.274202 hartree
zpe.thermalcorrgfe: 0.213371 hartree
zpe.sumelectzpe: -541.319696 hartree
zpe.sumelectthermal: -541.304306 hartree
zpe.sumelectthermalent: -541.303362 hartree
zpe.sumelectthermalfe: -541.364193 hartree
dipole: -1.6827 -5.6802 -0.5601
dipole: 5.9506
quadrupole: -68.3803 -90.9166 -73.8854
quadrupole: -0.4203 5.3343 1.5469
quadrupole: 9.3471 -13.1892 3.8421 -0.4203 5.3343 1.5469
hfenergy: -541.5775636 hartree
pointgroup: C01 [X(C10H18O2)]
dipole: -1.4591258 -1.7481692 -0.5439091 debye
polarizability: 120.7748611|1.7716082|115.6720404|-0.2038414|4.694318|98.0423537 unknown
InChI: InChI=1S/C10H18O2/c1-8(2)10(6-7-11)5-4-9(3)12/h7-8,10H,4-6H2,1-3H3
charge 0 multiplicity 1
30 atoms
O  2.636467 2.50215 0.304503
O  -1.726454 1.53143 1.067316
C  0.552999 -0.494832 0.069999
C  0.601202 -2.044754 -0.145647
C  -0.270103 0.240075 -1.028718
C  1.967459 0.137163 0.186362
C  -1.796755 0.068256 -0.897099
C  1.512759 -2.479171 -1.3202
C  0.998308 -2.790485 1.151855
C  1.918185 1.560801 0.721654
C  -2.421894 0.855356 0.262082
C  -3.942177 0.804749 0.374799
H  0.039626 -0.317194 1.037837
H  -0.434002 -2.363213 -0.396589
H  -0.044364 1.322772 -0.985563
H  0.05383 -0.108228 -2.029141
H  2.57692 -0.450935 0.906632
H  2.507572 0.136412 -0.777657
H  -2.31211 0.388393 -1.827106
H  -2.076676 -0.999168 -0.772717
H  1.26978 -1.94502 -2.257308
H  1.401959 -3.561931 -1.514867
H  2.578091 -2.292147 -1.090665
H  0.323608 -2.529092 1.988559
H  0.95335 -3.885852 1.006425
H  2.031836 -2.544197 1.461493
H  1.186293 1.725534 1.553171
H  -4.263756 1.148507 1.37026
H  -4.33115 -0.210789 0.179076
H  -4.3886 1.475606 -0.385549
