program: Gaussian 09
title: 000227611
version: EM64L-G09RevD.01
frameworkgroup: C1[X(C8H13NO4)]
method: RPBEPBE
basis: SDD
operation: Freq
keyword: #p
keyword: freq=noraman
keyword: PBEPBE/SDD
title: #p freq=noraman PBEPBE/SDD
converged: YES YES NO NO
title: Mulliken charges:
elementType: O O O O N C C C C C C C C H H H H H H H H H H H H H
charge: -0.448838 -0.208654 -0.202472 -0.269374 -0.411300 -0.390517 -0.144642 -0.488570 0.130782 0.229805 0.244902 -0.770911 -0.775052 0.257040 0.274932 0.306352 0.237485 0.241118 0.343762 0.241204 0.259422 0.229313 0.256252 0.212369 0.253859 0.391736
chargesum: 0.00000
title: Mulliken charges with hydrogens summed into heavy atoms:
elementType: O O O O N C C C C C C C C
charge: -0.057103 -0.208654 -0.202472 -0.269374 -0.067538 0.141455 0.161710 -0.009967 0.130782 0.229805 0.244902 -0.040972 -0.052573
polarizability: 1.04296392e+02 -6.48491751e+00 1.05175760e+02 5.47112346e+00 2.61418426e+00 1.02222618e+02
1716.lowfreq: -13.4006 -4.7137 -3.3092 -0.0001 0.0007 0.0009 23.4871 26.2356 39.6435
frequency: 22.4084 26.2267 39.5842 43.7726 64.4707 85.5631 86.1710 99.9915 122.3678 167.7790 200.7905 240.6006 314.5618 353.2840 376.5912 450.3032 464.1603 511.9929 530.2097 566.9833 578.2924 611.7847 615.7706 641.2487 712.2811 738.9115 803.2861 855.7682 889.7183 930.3915 942.9352 963.5682 988.5109 1038.3340 1042.3858 1074.2461 1101.4105 1134.7488 1166.8670 1180.9359 1228.2664 1242.4888 1274.9636 1291.6069 1309.8151 1329.3701 1361.6632 1370.2916 1387.9600 1430.7307 1443.4953 1449.2155 1457.7843 1461.8519 1463.8538 1477.3344 1612.9445 1638.0844 1676.5941 2956.2264 2980.3398 2996.6268 2999.2659 3008.1485 3035.0365 3066.5556 3097.7382 3098.8146 3100.5754 3119.6536 3523.7323 3557.0436
redmass: 1.8491 4.8748 5.3767 2.0146 5.1769 1.5739 1.7895 2.3142 3.4587 4.6639 4.1431 4.6447 4.1842 4.3437 2.8834 3.4899 2.0995 4.0550 2.9299 2.6620 2.1816 1.6227 3.2314 1.6751 4.6098 1.3781 3.4058 3.5631 2.3600 1.8909 3.2368 2.0631 1.5918 1.8931 1.6530 2.7601 2.1995 3.2246 2.0883 1.3788 1.4003 1.6841 1.2742 1.7675 1.6577 1.6804 1.5086 1.2408 1.2303 1.1017 1.0688 1.0457 1.0600 1.2345 1.1130 1.6453 6.5944 7.8080 9.1672 1.0611 1.0384 1.0362 1.0813 1.0960 1.0614 1.0952 1.0988 1.1033 1.1000 1.1003 1.0644 1.0783
irintensity: 0.7937 4.0379 1.3494 4.8647 5.5975 0.2360 0.1689 2.7018 3.3248 17.3223 0.1355 1.1770 0.4720 2.3424 2.9999 9.4445 1.5428 28.8143 81.4701 39.8517 7.2237 60.6398 8.2253 132.1426 17.6011 12.0696 11.7155 0.2076 7.1819 14.8380 43.9435 19.2790 7.1814 93.5048 14.7389 60.1932 49.1116 8.1794 50.0859 14.2635 10.1458 46.7550 6.1138 25.7741 75.8411 21.3000 12.5944 60.0178 65.2246 16.2281 25.2502 14.4294 29.3467 144.7406 41.4680 165.1108 147.9884 113.6979 213.4713 15.6694 5.4052 10.0013 14.2943 9.4459 6.2018 14.7611 10.5777 8.1458 16.3374 13.1590 32.0287 50.7921
temp: 298.150 k
press: 1.00000 atm
elementType: 8 8 8 8 7 6 6 6 6 6 6 6 6 1 1 1 1 1 1 1 1 1 1 1 1 1
symmnumber: 1
zpe: 539679.0 jmol-1
zpe.correction: 0.205553 hartree
zpe.thermalcorrener: 0.221021 hartree
zpe.thermalcorrenthalpy: 0.221965 hartree
zpe.thermalcorrgfe: 0.159210 hartree
zpe.sumelectzpe: -667.301089 hartree
zpe.sumelectthermal: -667.285621 hartree
zpe.sumelectthermalent: -667.284677 hartree
zpe.sumelectthermalfe: -667.347432 hartree
dipole: 1.1879 1.3744 7.0154
dipole: 7.2468
quadrupole: -78.6175 -79.5780 -80.0332
quadrupole: 2.3517 -1.9483 -1.7275
quadrupole: 0.7921 -0.1685 -0.6236 2.3517 -1.9483 -1.7275
hfenergy: -667.5066417 hartree
pointgroup: C01 [X(C8H13N1O4)]
dipole: -0.4305016 -0.7763033 2.7093846 debye
dipolederiv: -0.5326242 -0.0891862 0.2309106 -0.1333748 -0.4046636 0.2221533 0.3065047 0.1609359 -1.0352298 -0.4206585 0.1300306 0.1790214 0.1610373 -0.8825563 -0.2968519 0.1409196 -0.0675816 -0.640924 -0.6341501 -0.1364909 0.0634511 -0.1547049 -0.3434603 0.1079731 0.0566914 0.093981 -0.7900229 -0.5004017 0.1186975 0.0771338 0.2329047 -0.6944074 0.1028622 -0.096582 0.3050745 -0.8408179 -0.8297615 0.3373476 -0.0363973 0.3951258 -1.0115831 0.0649398 -0.0550245 0.0959358 -0.4102123 0.0855296 0.1274845 0.0031908 0.0461463 -0.0152946 0.0235769 0.0317048 -0.0497114 0.0513903 0.3738788 -0.1534838 -0.0571864 -0.1327593 0.0436661 0.1141592 -0.1835767 0.3772643 0.1695893 -0.4149313 -0.2378437 0.0123449 -0.3132069 0.0295044 0.0513028 0.1509431 0.0894504 -0.0555987 0.4024977 -0.1209784 -0.4204293 -0.0207403 1.2825818 0.0342658 -0.4468642 -0.135009 1.2681791 1.0506952 0.3827011 0.0949176 0.4373644 0.2525842 -0.0843233 0.0840515 -0.0870446 0.9862638 0.6844323 -0.5734742 -0.1316069 -0.7680052 1.2260192 -0.1905477 0.0236937 -0.3487762 0.9857571 -0.2536127 -0.0852372 -0.2192012 -0.1226863 0.0003801 -0.1261984 -0.2518285 -0.0848602 -0.3405102 -0.1313339 0.1384545 0.1510789 0.1570521 -0.1214553 -0.1742183 0.1561387 -0.155785 -0.1478601 0.0149107 0.0560298 0.0416084 0.0415285 0.0537439 -0.0808035 0.0111947 -0.07658 -0.0044738 0.085199 -0.0359264 -0.022573 -0.0030984 -0.0388602 0.0419911 -0.0490378 0.0335052 0.0697622 0.0156875 -0.019251 -0.0490587 -0.0040688 0.0830487 0.0101366 -0.0110069 -0.1060124 0.0163965 0.0931779 0.0038963 0.0666307 0.0346229 0.040087 -0.0802423 0.0046885 -0.0894754 -0.0508762 0.0481209 0.0330497 -0.0147578 0.0473976 -0.0711755 0.0821787 -0.0494409 0.0463601 0.0528291 0.2923861 0.048184 0.031061 0.0530234 0.2903843 0.0215603 0.0711058 -0.0174567 0.1591456 0.0746254 0.0856337 0.0271261 0.0557431 -0.0096809 -0.0802309 0.0147518 -0.0603358 0.0631457 -0.1030806 -0.0326256 0.0076688 -0.0316113 0.1183514 0.0174794 0.0556294 0.0089755 0.0736861 0.0975857 -0.0543207 0.0030245 -0.0061344 -0.0361728 0.1316284 0.0063924 0.0911204 0.0290075 -0.0708967 0.0412772 -0.0268597 0.0113587 0.1271901 0.0107538 -0.0666353 -0.0021816 0.0693861 0.0974414 0.0358821 -0.0093175 0.011917 0.0146751 0.1307134 0.0341872 0.067441 -0.0953642 0.0904232 -0.0936077 -0.0147746 -0.058873 -0.0464105 -0.0373436 0.0273178 -0.0243445 0.0803898 0.38486 0.0937575 0.0129939 0.0640417 0.113504 -0.016915 0.0340819 -0.0648896 0.3369617 unknown
polarizability: 104.0039342|-6.005082|105.7077008|-6.0720001|-2.1711247|101.9831341 unknown
InChI: InChI=1S/C8H13NO4/c1-5(10)3-4-7(8(12)13)9-6(2)11/h7,9,12H,3-4H2,1-2H3
charge 0 multiplicity 1
26 atoms
O  -1.189982 -2.31424 1.088462
O  -0.242542 -2.952643 -0.934447
O  3.284748 0.953889 -1.063551
O  -2.091357 1.858952 -1.086873
N  -1.53232 0.195627 0.430571
C  0.633301 -0.014299 -0.867901
C  -0.794028 -0.57596 -0.580109
C  1.557608 -0.028587 0.360345
C  -0.70993 -2.051923 -0.210913
C  2.92776 0.605444 0.092058
C  -2.166572 1.380173 0.086573
C  3.831829 0.80503 1.30425
C  -2.949676 2.06081 1.204389
H  1.082471 -0.600997 -1.687945
H  0.508463 1.016547 -1.240131
H  -1.351105 -0.50398 -1.535905
H  1.089392 0.498108 1.217258
H  1.743358 -1.066721 0.711545
H  -1.669758 -0.228809 1.349345
H  3.503556 1.70541 1.860293
H  4.873485 0.959484 0.982103
H  3.773478 -0.049116 2.002923
H  -3.994903 2.197515 0.877975
H  -2.940765 1.499495 2.154666
H  -2.530163 3.066605 1.379548
H  -1.110252 -3.287015 1.281474
