program: Gaussian 09
title: 000227609
version: EM64L-G09RevD.01
frameworkgroup: C1[X(C16H13ClN2)]
method: RPBEPBE
basis: SDD
operation: Freq
keyword: #p
keyword: freq=noraman
keyword: PBEPBE/SDD
title: #p freq=noraman PBEPBE/SDD
converged: YES YES NO NO
title: Mulliken charges:
elementType: Cl N N C C C C C C C C C C C C C C C C H H H H H H H H H H H H H
charge: -0.014410 -0.162378 -0.101551 -0.546928 0.128212 0.427043 0.323013 -0.060447 -0.312793 -0.366135 -0.375744 -0.365134 -0.337708 -0.240584 -0.222385 -0.230467 -0.269112 -0.236396 -0.232541 0.256562 0.270571 0.267558 0.262552 0.229359 0.269711 0.257198 0.232000 0.229500 0.229205 0.229164 0.232269 0.230797
chargesum: 0.00000
title: Mulliken charges with hydrogens summed into heavy atoms:
elementType: Cl N N C C C C C C C C C C C C C C C C
charge: -0.014410 -0.162378 -0.101551 -0.019796 0.128212 0.427043 0.323013 -0.060447 -0.045235 -0.103582 -0.146385 -0.095424 -0.080510 -0.008584 0.007115 -0.001261 -0.039948 -0.004127 -0.001744
polarizability: 2.42468334e+02 6.09040935e+00 2.06789674e+02 -4.47507677e+00 9.81790059e+00 1.27607547e+02
1716.lowfreq: -13.3323 -4.1969 -0.0019 -0.0017 -0.0015 2.6488 9.8561 34.3642 49.3280
frequency: -9.5841 34.2102 49.3120 60.2345 81.9805 105.8052 165.4805 172.4430 229.1021 254.7032 281.4060 289.3008 312.3512 382.4889 400.5685 409.1041 444.3958 456.2969 492.2088 547.0687 571.6022 611.5341 615.6875 622.8463 680.5596 698.2085 700.9250 704.4143 736.1269 764.6879 774.6913 796.0163 812.0358 853.1534 859.1840 879.5068 907.8732 932.5497 976.9854 981.4366 983.8865 989.6674 989.7103 1000.1328 1000.3064 1023.1625 1027.1953 1055.4658 1081.7426 1086.5416 1110.1919 1170.3051 1174.1627 1174.5996 1190.4145 1194.9496 1198.1154 1244.3388 1260.4986 1303.3405 1314.4665 1337.4145 1348.1286 1369.5123 1380.6881 1392.8152 1431.9911 1441.3631 1445.2419 1465.6348 1473.7638 1485.9536 1513.6118 1584.4779 1596.7819 1615.1968 1617.3534 3002.8560 3053.5978 3114.8761 3127.3131 3129.1833 3136.7702 3140.0096 3149.3953 3151.1088 3160.1055 3166.6250 3170.6417 3247.0943
redmass: 3.9597 5.4394 5.5364 5.6824 6.0540 5.6003 5.4468 5.0837 5.1615 5.7908 8.9090 2.9113 5.6496 4.2667 2.8185 2.9197 6.9035 2.7597 4.6243 4.3306 5.4046 5.9487 6.3800 5.6377 6.2043 5.6800 2.3887 1.8701 1.3767 6.2005 1.9470 4.3079 1.3229 1.2498 1.2642 3.4136 1.5702 1.4083 1.6753 1.6505 1.9534 2.9802 5.3654 1.3676 1.3552 2.8820 2.2577 2.9145 1.7445 1.6273 1.8921 2.1553 1.0831 1.1143 1.1121 1.2553 2.2197 2.4370 2.6481 1.5223 1.6142 1.9186 1.5293 3.7684 7.5255 4.1629 2.6493 2.1709 2.3553 1.1996 5.4751 2.2135 4.2035 6.0207 6.0748 6.0303 5.9305 1.0597 1.1019 1.0880 1.0848 1.0860 1.0884 1.0911 1.0932 1.0958 1.0964 1.1015 1.1003 1.0997
irintensity: 0.0150 0.0813 0.2722 0.9348 0.2644 0.0719 0.7342 1.1699 0.6954 3.1969 1.6067 2.2150 3.2897 4.2083 0.1117 0.1869 8.8482 8.1190 6.1825 5.7909 7.7274 1.2106 0.2470 2.8394 3.9504 16.0902 21.0804 41.2007 71.6651 1.2951 49.6210 2.5643 28.4925 0.3105 0.8581 14.3434 8.7856 2.5111 14.6185 13.4013 1.3379 1.0954 0.7671 1.6416 2.0456 0.8631 9.4113 12.0752 11.7043 5.9342 1.2621 8.4550 0.4004 0.5284 3.2720 0.7195 0.5099 4.0573 10.6788 15.6593 12.8971 32.6047 1.5443 18.6218 16.3079 2.2809 11.5844 13.7410 14.3547 24.5874 111.2818 16.2853 1.7004 0.4214 0.6858 8.4089 6.8181 13.1601 1.9070 8.4930 0.5519 0.3582 8.2138 13.8809 18.9627 29.7751 16.5186 21.3757 19.5292 2.9650
temp: 298.150 k
press: 1.00000 atm
elementType: 17 7 7 6 6 6 6 6 6 6 6 6 6 6 6 6 6 6 6 1 1 1 1 1 1 1 1 1 1 1 1 1
symmnumber: 1
zpe: 648801.8 jmol-1
zpe.correction: 0.247116 hartree
zpe.thermalcorrener: 0.261841 hartree
zpe.thermalcorrenthalpy: 0.262786 hartree
zpe.thermalcorrgfe: 0.203933 hartree
zpe.sumelectzpe: -1185.741184 hartree
zpe.sumelectthermal: -1185.726459 hartree
zpe.sumelectthermalent: -1185.725514 hartree
zpe.sumelectthermalfe: -1185.784367 hartree
dipole: 1.2175 -2.8536 -1.6706
dipole: 3.5237
quadrupole: -111.4451 -113.6423 -114.7555
quadrupole: -1.1723 2.1343 -0.4890
quadrupole: 1.8359 -0.3613 -1.4746 -1.1723 2.1343 -0.4890
hfenergy: -1185.9883 hartree
pointgroup: C01 [X(C16H13Cl1N2)]
dipole: 0.4339237 1.2242113 0.4846762 debye
polarizability: 241.7851512|-4.4760212|207.6523458|11.3376982|-3.8044027|127.4280575 unknown
InChI: InChI=1S/C16H13ClN2/c17-15-11-18-16(14-9-5-2-6-10-14)19(15)12-13-7-3-1-4-8-13/h1-11H,12H2
charge 0 multiplicity 1
32 atoms
Cl 2.470299 -2.841347 1.119114
N  0.252369 -1.212212 0.640455
N  -1.261238 -2.574515 -0.374443
C  0.868312 -0.079732 1.350521
C  -1.034842 -1.30882 0.070428
C  1.835339 0.755323 0.508813
C  -2.033736 -0.229541 -0.017175
C  0.82495 -2.487786 0.51427
C  -0.107482 -3.31226 -0.105726
C  1.948379 0.595086 -0.89229
C  2.631546 1.731336 1.15937
C  -3.408105 -0.601116 0.00649
C  -1.699057 1.145395 -0.168337
C  2.842665 1.402388 -1.632952
C  3.521478 2.540069 0.420224
C  -4.417168 0.376792 -0.091957
C  -2.715058 2.121747 -0.258909
C  3.629653 2.377857 -0.981189
C  -4.076489 1.745525 -0.215447
H  1.403639 -0.481362 2.230642
H  0.047248 0.552531 1.733768
H  -0.015576 -4.361926 -0.369489
H  1.348124 -0.16457 -1.405285
H  2.558582 1.857622 2.24729
H  -3.657142 -1.663084 0.095548
H  -0.654323 1.457431 -0.26731
H  2.92402 1.26645 -2.717038
H  4.132197 3.290035 0.935076
H  -5.469785 0.073531 -0.070392
H  -2.440244 3.175328 -0.380509
H  4.322632 3.0019 -1.556091
H  -4.861884 2.505925 -0.287469
