program: Gaussian 09
title: 000227607
version: EM64L-G09RevD.01
frameworkgroup: C1[X(C15H8N2O9)]
method: RPBEPBE
basis: SDD
operation: Freq
keyword: #p
keyword: freq=noraman
keyword: PBEPBE/SDD
title: #p freq=noraman PBEPBE/SDD
converged: YES YES NO NO
title: Mulliken charges:
elementType: O O O O O O O O O N N C C C C C C C C C C C C C C C H H H H H H H H
charge: -0.241670 -0.241672 -0.233654 -0.188535 -0.188533 -0.185631 -0.185631 -0.200583 -0.200567 0.017010 0.016992 0.262259 0.262232 0.274911 0.274922 0.372886 0.372888 -0.511867 -0.511866 -0.334252 -0.334254 -0.279298 -0.279300 0.265140 -0.167248 -0.167177 0.319295 0.319299 0.292802 0.292798 0.314373 0.314375 0.239807 0.239751
chargesum: 0.00000
title: Mulliken charges with hydrogens summed into heavy atoms:
elementType: O O O O O O O O O N N C C C C C C C C C C C C C C C
charge: -0.241670 -0.241672 -0.233654 -0.188535 -0.188533 -0.185631 -0.185631 -0.200583 -0.200567 0.017010 0.016992 0.262259 0.262232 0.274911 0.274922 0.372886 0.372888 -0.192572 -0.192567 -0.041450 -0.041457 0.035076 0.035076 0.265140 0.072559 0.072574
polarizability: 4.02089884e+02 -2.10549260e-03 2.45979681e+02 8.49607871e-04 6.49426105e+00 8.16249604e+01
1716.lowfreq: -3.7110 0.0005 0.0006 0.0012 2.8884 9.6597 12.4481 18.0874 38.2136
frequency: 12.4021 18.0406 38.2123 42.5280 47.7463 49.8954 54.4398 79.5284 81.0275 99.3047 118.9731 123.1043 141.6536 181.8940 186.4736 204.5940 247.6817 253.6554 267.3003 302.0298 308.2033 321.1646 370.7523 376.7601 390.3682 403.8612 425.8264 446.2976 446.7241 527.2941 533.9473 564.9982 574.8990 576.3379 629.9684 640.2539 659.4373 661.7516 666.6357 668.7024 686.3333 710.7674 729.0773 732.1253 770.6747 785.0088 790.0789 860.4725 863.9698 867.7456 929.7689 932.5787 941.9161 978.2607 978.7156 996.8400 997.1940 1005.1098 1053.4448 1060.8623 1115.0548 1119.7293 1127.9734 1161.4325 1174.6170 1194.3052 1208.8598 1210.3349 1215.4279 1252.2005 1257.0498 1344.9571 1344.9929 1376.7103 1377.7627 1404.0482 1404.4573 1420.7583 1421.1522 1457.6712 1460.3291 1562.8512 1565.8468 1588.6954 1589.2517 1616.9750 1618.5558 1643.4162 3022.1633 3022.2291 3164.0314 3164.1696 3181.6667 3181.7229 3212.3730 3212.7688
redmass: 8.8626 11.9972 10.8078 14.3174 13.1363 14.8911 9.5840 4.1833 3.9858 6.8483 10.2132 6.4642 10.1909 5.7207 7.6499 12.5917 4.6885 4.7350 9.0142 6.8228 7.6426 10.5124 8.0612 7.1652 8.7258 11.1024 9.7849 3.1495 3.1494 6.8337 6.4489 6.2657 6.1669 5.0410 6.4856 7.2921 5.3630 5.8339 11.3338 8.0285 9.3231 7.3602 5.0988 5.3896 10.6735 8.6146 7.3154 4.2775 1.4025 1.6748 1.6444 1.4569 3.2176 1.7039 1.7013 1.3581 1.3826 3.2598 5.3688 5.1516 2.7694 3.5824 2.1664 2.1508 1.5352 2.6342 9.4913 8.0710 3.6924 1.4448 1.6010 2.2584 2.2748 2.5440 2.5509 9.5260 8.7455 3.0469 3.1438 2.6806 2.7230 7.3453 7.0838 8.1843 8.1889 7.5434 7.5344 11.3129 1.0896 1.0896 1.0922 1.0922 1.0911 1.0911 1.0954 1.0953
irintensity: 0.0004 1.5180 0.7413 2.0352 0.0409 2.8472 0.0902 25.4966 1.6739 3.1684 2.8780 1.1317 1.2553 1.0399 3.0290 0.6706 0.0728 11.6819 3.6265 1.8876 1.2727 0.0680 29.4961 2.4538 1.3794 17.7942 3.8436 1.3109 10.4444 1.5057 1.6927 0.2322 9.0370 2.0661 6.1548 0.5816 2.4916 18.2938 27.3673 27.3359 20.1730 12.5089 3.9314 1.8659 0.2125 180.3532 4.9873 37.9147 3.5586 83.3453 9.0171 22.4811 2.5513 1.2879 30.2349 0.9068 3.0672 0.4146 12.4195 1.0651 1490.3896 2096.3615 11.1900 458.8274 44.3878 213.2061 41.1416 110.2947 16.1539 65.0062 20.1594 11.6422 177.0122 87.7651 70.6501 6.3669 2.9065 20.7290 16.5746 118.9387 0.2922 171.9929 105.1336 5.9509 147.4088 97.5154 85.5497 130.0954 53.9649 5.9578 4.1725 19.4289 5.1017 0.8665 8.1707 6.7127
temp: 298.150 k
press: 1.00000 atm
elementType: 8 8 8 8 8 8 8 8 8 7 7 6 6 6 6 6 6 6 6 6 6 6 6 6 6 6 1 1 1 1 1 1 1 1
symmnumber: 1
zpe: 561121.3 jmol-1
zpe.correction: 0.213720 hartree
zpe.thermalcorrener: 0.236691 hartree
zpe.thermalcorrenthalpy: 0.237636 hartree
zpe.thermalcorrgfe: 0.156536 hartree
zpe.sumelectzpe: -1360.875704 hartree
zpe.sumelectthermal: -1360.852732 hartree
zpe.sumelectthermalent: -1360.851788 hartree
zpe.sumelectthermalfe: -1360.932888 hartree
dipole: 0.0001 -3.5612 -0.8972
dipole: 3.6725
quadrupole: -218.4752 -166.5198 -144.9740
quadrupole: 0.0015 -0.0059 -3.5724
quadrupole: -41.8188 10.1365 31.6824 0.0015 -0.0059 -3.5724
hfenergy: -1361.0894236 hartree
pointgroup: C01 [X(C15H8N2O9)]
dipole: -0.0004542 -1.4170467 -0.2822084 debye
polarizability: 402.0877759|-0.2863384|220.7673445|0.7697156|59.5837897|106.839405 unknown
InChI: InChI=1S/C15H8N2O9/c18-7-9-5-11(1-3-13(9)16(21)22)25-15(20)26-12-2-4-14(17(23)24)10(6-12)8-19/h1-8H
charge 0 multiplicity 1
34 atoms
O  -1.093731 0.341652 0.347969
O  1.092087 0.339909 0.3534
O  -0.000072 -1.551833 -0.558456
O  -5.194345 2.821029 1.513014
O  5.190783 2.811432 1.541363
O  -6.937683 -2.079061 -0.57582
O  6.936615 -2.089399 -0.543668
O  -7.46146 0.132645 -0.398742
O  7.463077 0.121317 -0.362344
N  -6.617089 -0.845646 -0.377881
N  6.617027 -0.855617 -0.346407
C  -4.761159 0.68039 0.481717
C  4.759348 0.672617 0.505574
C  -5.182729 -0.535287 -0.133585
C  5.181993 -0.543161 -0.108807
C  -2.445977 -0.057683 0.144438
C  2.444681 -0.061455 0.156276
C  -3.369788 0.894779 0.611399
C  3.367704 0.8891 0.628647
C  -4.252078 -1.497606 -0.577859
C  4.251997 -1.503588 -0.558515
C  -2.868666 -1.271451 -0.449467
C  2.868337 -1.27535 -0.436672
C  -0.000517 -0.430285 -0.020372
C  -5.659595 1.732152 1.090428
C  5.656443 1.722374 1.119698
H  -3.025319 1.817675 1.089129
H  3.02236 1.812093 1.10556
H  -4.623472 -2.420138 -1.031322
H  4.624137 -2.426287 -1.011028
H  -2.149578 -2.010545 -0.802881
H  2.149794 -2.012981 -0.794228
H  -6.736692 1.492344 1.170068
H  6.732667 1.480567 1.204874
