program: Gaussian 09
title: 000227605
version: EM64L-G09RevD.01
frameworkgroup: C1[X(C13H10N2O5S)]
method: RPBEPBE
basis: SDD
operation: Freq
keyword: #p
keyword: freq=noraman
keyword: PBEPBE/SDD
title: #p freq=noraman PBEPBE/SDD
converged: YES YES NO NO
title: Mulliken charges:
elementType: S O O O O O N N C C C C C C C C C C C C C H H H H H H H H H H
charge: 0.875104 -0.522095 -0.528548 -0.194826 -0.196008 -0.236455 -0.408107 0.026869 -0.089302 -0.082249 -0.219530 -0.227649 -0.202702 -0.202258 0.487134 -0.406400 -0.322271 -0.335000 -0.334543 0.393552 -0.057947 0.284700 0.277711 0.290608 0.289150 0.234967 0.318313 0.297910 0.297119 0.312233 0.180521
chargesum: 0.00000
title: Mulliken charges with hydrogens summed into heavy atoms:
elementType: S O O O O O N N C C C C C C C C C C C C C
charge: 0.875104 -0.522095 -0.528548 -0.194826 -0.196008 -0.236455 -0.095874 0.026869 -0.089302 -0.082249 0.065169 0.050062 0.087906 0.086893 0.487134 -0.171433 -0.003958 -0.037090 -0.037424 0.393552 0.122574
polarizability: 2.79384932e+02 -6.55201617e+00 1.59860467e+02 1.70141878e+00 -1.61578358e+01 1.88966942e+02
1716.lowfreq: -4.9804 -0.0005 0.0008 0.0016 2.5757 5.1814 19.8230 25.3859 33.8094
frequency: 19.7886 25.3336 33.7943 65.2088 67.9956 88.3950 99.8011 119.2662 128.5597 183.1595 197.8348 215.4291 224.4396 248.2642 279.1572 290.8035 341.7286 351.3159 396.7499 403.6243 411.2359 412.5745 417.9505 485.7556 500.7084 505.4583 541.2533 571.0764 613.0783 617.8210 656.3751 663.9123 680.3862 730.2249 737.6475 749.0164 778.9418 793.0955 835.1543 836.7658 856.9485 869.3171 876.7025 927.9322 953.3168 964.0645 987.8760 991.5479 994.8337 998.0802 1000.6704 1044.7990 1054.2065 1085.9289 1095.5732 1103.2279 1123.1278 1168.3324 1184.3955 1217.2682 1259.4167 1278.7638 1294.2691 1361.2203 1369.8506 1390.6833 1391.4902 1404.5857 1422.5767 1451.6021 1475.1299 1503.1837 1581.3876 1596.1492 1600.0284 1607.7926 1643.0276 2947.2139 3128.3084 3155.8820 3158.7724 3159.6496 3162.3238 3186.8013 3188.8662 3194.8485 3515.0739
redmass: 10.7395 5.6626 5.8704 6.3161 5.8993 6.5377 10.5187 5.8464 7.7168 10.6885 12.9433 7.4828 8.2813 5.0846 6.4264 7.6407 6.3211 5.7643 6.9473 5.8896 2.8996 5.8005 3.7090 6.2794 4.7428 7.2696 2.8288 7.0957 7.0928 7.1152 1.1730 4.8273 8.6445 3.4638 4.2908 6.1353 10.9373 11.4569 5.2814 1.4382 1.2447 1.4729 1.5545 16.7814 1.5999 1.3721 4.8874 1.4996 3.8350 1.3915 1.3667 2.3324 2.6045 4.0829 2.9377 1.2847 1.3279 1.2222 1.1343 8.8747 1.9587 1.2492 1.3702 2.3630 6.1437 1.5377 5.7929 4.9300 7.3167 2.1798 2.2140 2.2939 6.1996 6.0540 5.9176 8.3147 4.9618 1.0873 1.0899 1.0910 1.0908 1.0909 1.0950 1.0949 1.0961 1.0956 1.0771
irintensity: 0.2870 1.2637 4.6660 1.4034 1.3396 8.5339 5.9370 4.9255 2.2507 1.6868 7.2432 15.6721 6.8083 12.9385 4.0656 7.2617 3.3881 4.2632 4.2469 11.6509 0.4313 31.9433 13.2141 28.0565 51.9451 0.6236 57.9875 116.1287 0.0955 1.1392 69.9704 29.5303 42.2487 2.0679 3.9390 11.7449 68.9930 47.3195 10.4014 27.7318 1.9443 35.9664 53.2700 67.3552 1.2314 2.0597 1.5232 1.7811 10.1512 1.6717 0.5666 41.2851 25.0237 5.9877 41.7709 7.5372 18.4079 9.5240 43.4100 282.6068 36.9790 0.6432 22.5160 66.1011 45.5663 112.2391 57.4621 19.9095 49.2256 11.2606 22.1151 359.9621 35.1849 138.4001 5.8003 0.2174 181.3266 126.4603 12.4976 1.7188 3.1992 5.0133 6.6313 2.6337 1.1158 7.2650 18.4292
temp: 298.150 k
press: 1.00000 atm
elementType: 16 8 8 8 8 8 7 7 6 6 6 6 6 6 6 6 6 6 6 6 6 1 1 1 1 1 1 1 1 1 1
symmnumber: 1
zpe: 557735.7 jmol-1
zpe.correction: 0.212430 hartree
zpe.thermalcorrener: 0.231374 hartree
zpe.thermalcorrenthalpy: 0.232318 hartree
zpe.thermalcorrgfe: 0.162386 hartree
zpe.sumelectzpe: -1383.330384 hartree
zpe.sumelectthermal: -1383.311440 hartree
zpe.sumelectthermalent: -1383.310496 hartree
zpe.sumelectthermalfe: -1383.380428 hartree
dipole: 5.2089 -2.3567 -4.6859
dipole: 7.3922
quadrupole: -135.8475 -156.2201 -121.2323
quadrupole: -13.2923 -24.8617 1.3132
quadrupole: 1.9191 -18.4534 16.5343 -13.2923 -24.8617 1.3132
hfenergy: -1383.5428142 hartree
pointgroup: C01 [X(C13H10N2O5S1)]
dipole: -2.035477 -0.8990687 1.8726273 debye
polarizability: 279.3696609|6.9618293|160.4744646|0.9724322|16.6244076|188.3682155 unknown
InChI: InChI=1S/C13H10N2O5S/c16-9-14-10-1-5-12(6-2-10)21(19,20)13-7-3-11(4-8-13)15(17)18/h1-9,14H
charge 0 multiplicity 1
31 atoms
S  0.038897 2.113639 -0.401104
O  -0.034988 2.498973 -1.989369
O  0.170632 3.212848 0.805578
O  5.342625 -2.173803 -0.890339
O  5.509032 -1.61432 1.314704
O  -5.510655 -2.24185 -1.107897
N  -4.895251 -1.201916 0.925554
N  4.944419 -1.537353 0.15792
C  -1.469964 1.04833 -0.006347
C  1.539955 0.952601 -0.216578
C  -1.958639 1.064313 1.310135
C  -2.088394 0.341524 -1.049141
C  1.987494 0.272091 -1.36047
C  2.172438 0.885459 1.035404
C  -3.74382 -0.451232 0.568005
C  -3.10593 0.301538 1.594662
C  -3.236344 -0.425179 -0.7624
C  3.120467 -0.558591 -1.236189
C  3.305526 0.055118 1.1612
C  3.750058 -0.656158 0.024552
C  -5.685918 -2.020106 0.117397
H  -1.471769 1.678053 2.074854
H  -1.700614 0.408813 -2.071021
H  1.480615 0.414761 -2.320264
H  1.804186 1.487637 1.872185
H  -3.512265 0.296206 2.613406
H  -3.745341 -0.991663 -1.544014
H  3.522122 -1.11796 -2.084721
H  3.846015 -0.044871 2.10575
H  -5.185459 -1.137535 1.905478
H  -6.520325 -2.47256 0.699468
