program: Gaussian 09
title: 000227604
version: EM64L-G09RevD.01
frameworkgroup: C1[X(C12H16O3S)]
method: RPBEPBE
basis: SDD
operation: Freq
keyword: #p
keyword: freq=noraman
keyword: PBEPBE/SDD
title: #p freq=noraman PBEPBE/SDD
converged: YES YES NO NO
title: Mulliken charges:
elementType: S O O O C C C C C C C C C C C C H H H H H H H H H H H H H H H H
charge: 0.245502 -0.467188 -0.395245 -0.255736 0.260850 -0.486585 -0.472367 -0.243590 -0.403872 -0.402328 -0.386897 -0.144848 0.173690 -0.287772 -0.141347 -0.512667 0.228804 0.210512 0.240957 0.220550 0.271695 0.202444 0.201389 0.203843 0.203209 0.205412 0.192103 0.355008 0.294133 0.244977 0.262487 0.382876
chargesum: 0.00000
title: Mulliken charges with hydrogens summed into heavy atoms:
elementType: S O O O C C C C C C C C C C C C
charge: 0.245502 -0.112180 -0.012369 -0.255736 0.260850 -0.047270 -0.010860 0.028105 -0.000039 0.004724 0.010618 -0.144848 0.173690 0.006361 0.103630 -0.250180
polarizability: 1.68818198e+02 1.61406608e+01 1.32791297e+02 -4.99188520e+00 5.19990479e+00 1.39504322e+02
1716.lowfreq: -12.5526 0.0022 0.0024 0.0025 10.0100 14.5095 26.7210 48.7829 62.5701
frequency: 26.2119 48.5741 62.5335 87.0264 98.1453 131.1356 176.2900 194.4643 248.2818 256.2396 274.1387 299.4024 333.5719 359.2839 409.4880 432.0979 450.9729 473.6004 484.9240 540.6361 553.5495 579.8170 587.6210 604.0749 618.6583 671.3260 693.4856 697.0373 769.2877 778.2179 802.8124 813.0478 829.6775 843.1976 848.2037 881.7212 910.7289 917.8249 927.7824 942.0761 951.4698 1020.2518 1031.7150 1049.7627 1061.5625 1071.2252 1078.2058 1098.2149 1122.0173 1132.6107 1153.9287 1178.5804 1218.9606 1228.3568 1250.0261 1259.4745 1268.1851 1288.8550 1315.6557 1325.6386 1332.4343 1335.6799 1338.4002 1346.4477 1348.1014 1392.1495 1462.3912 1465.6921 1468.8823 1470.8436 1478.9167 1484.5474 1546.0590 1627.1095 2966.0204 2970.1023 2971.8026 2982.2936 2999.1425 3026.7786 3032.6064 3038.5667 3042.1595 3046.4462 3066.0621 3174.8029 3197.1511 3237.1299 3421.1407 3497.4719
redmass: 6.7638 6.7942 5.1550 5.5986 3.7838 4.0399 4.8721 3.6770 3.6780 4.0770 4.4576 2.9123 6.1361 1.9744 3.6901 3.3116 3.4861 4.2305 2.9948 1.8382 2.6277 2.2204 1.5993 2.2604 3.7669 2.5848 5.2427 1.2024 3.8840 1.5436 4.3795 2.9964 3.7735 1.3838 1.8806 2.5898 2.2801 1.4274 1.4433 2.7684 2.4049 2.5497 2.1263 1.8376 2.0852 1.3270 1.3698 1.5151 1.7948 1.7957 2.3374 1.4795 1.4573 1.4064 1.3158 1.2520 1.4143 1.5915 1.4617 1.8828 1.4439 1.5183 1.5676 1.6630 1.6195 1.6280 1.0892 1.1269 3.4849 1.2332 1.0804 1.0929 5.6205 7.4839 1.0646 1.0645 1.0624 1.0615 1.0636 1.0957 1.0960 1.1005 1.0872 1.0970 1.1004 1.0902 1.0973 1.1003 1.0652 1.0638
irintensity: 0.2350 1.1020 0.5581 1.6703 0.4038 0.2179 1.3523 1.4130 1.5862 0.3522 1.4565 6.8453 6.2792 1.2563 5.5197 1.1364 2.2809 1.3292 14.6476 3.8251 49.2265 30.9178 114.7572 99.5971 32.9262 84.7847 20.2584 115.4260 16.5923 1.8825 2.9419 7.9708 1.1368 15.6498 18.6510 8.0629 5.9731 1.0422 5.4102 9.3353 8.1411 20.8022 29.0692 0.7136 247.4841 4.3871 19.6479 0.0535 27.8494 2.5234 5.5746 16.2484 10.7198 11.0380 6.0387 6.6322 3.9003 39.4026 2.1525 51.3751 11.1970 9.4329 3.5588 10.2960 13.4012 49.6997 4.8739 9.4985 7.7377 8.0825 25.6384 10.4526 1.0358 175.3359 24.0391 27.6636 34.3701 26.1592 13.4018 64.2336 64.0175 10.6167 11.9489 73.6604 36.6678 6.3499 1.7322 0.7048 65.9159 25.0542
temp: 298.150 k
press: 1.00000 atm
elementType: 16 8 8 8 6 6 6 6 6 6 6 6 6 6 6 6 1 1 1 1 1 1 1 1 1 1 1 1 1 1 1 1
symmnumber: 1
zpe: 679055.4 jmol-1
zpe.correction: 0.258639 hartree
zpe.thermalcorrener: 0.273938 hartree
zpe.thermalcorrenthalpy: 0.274882 hartree
zpe.thermalcorrgfe: 0.215461 hartree
zpe.sumelectzpe: -1089.384256 hartree
zpe.sumelectthermal: -1089.368957 hartree
zpe.sumelectthermalent: -1089.368013 hartree
zpe.sumelectthermalfe: -1089.427434 hartree
dipole: 0.0896 0.0233 -1.9634
dipole: 1.9655
quadrupole: -93.9121 -98.7865 -106.6454
quadrupole: 0.8924 -3.6823 -4.9657
quadrupole: 5.8692 0.9948 -6.8640 0.8924 -3.6823 -4.9657
hfenergy: -1089.6428949 hartree
pointgroup: C01 [X(C12H16O3S1)]
dipole: 0.1362866 -0.0564878 0.759097 debye
polarizability: 169.2763337|-15.7497511|132.2735913|0.1327828|6.8746437|139.5638919 unknown
InChI: InChI=1S/C12H16O3S/c13-11(14)10(9-5-4-8-16-9)12(15)6-2-1-3-7-12/h4-5,8,10,13,15H,1-3,6-7H2
charge 0 multiplicity 1
32 atoms
S  -2.125888 0.821238 1.722402
O  0.527273 -0.512982 -2.107629
O  -0.177949 -2.465772 1.709808
O  -0.061867 -2.786341 -0.578111
C  1.027479 -0.021327 -0.809118
C  2.462618 -0.57094 -0.56101
C  1.073849 1.515918 -0.942255
C  0.053463 -0.474135 0.351966
C  3.1905 0.111831 0.623774
C  1.779366 2.207202 0.248063
C  3.207466 1.650269 0.45901
C  -1.351715 0.089691 0.254324
C  -0.058048 -2.000284 0.404037
C  -2.221079 0.131923 -0.827988
C  -3.49359 0.743532 -0.530374
C  -3.612579 1.169594 0.782918
H  3.02811 -0.385279 -1.494845
H  2.437745 -1.66994 -0.421495
H  0.049655 1.905451 -1.077154
H  1.625563 1.730254 -1.878018
H  0.491252 -0.1613 1.315536
H  4.224609 -0.277841 0.688583
H  2.701556 -0.153944 1.583859
H  1.186557 2.072876 1.176128
H  1.818927 3.297503 0.063553
H  3.679807 2.123936 1.341114
H  3.830477 1.91218 -0.420975
H  0.404354 -1.501016 -2.023233
H  -1.929428 -0.239519 -1.812022
H  -4.290132 0.864966 -1.2685
H  -4.449917 1.659471 1.276682
H  -0.311232 -3.453516 1.704167
