program: Gaussian 09
title: 000227603
version: EM64L-G09RevD.01
frameworkgroup: C1[X(C12H11ClN2O)]
method: RPBEPBE
basis: SDD
operation: Freq
keyword: #p
keyword: freq=noraman
keyword: PBEPBE/SDD
title: #p freq=noraman PBEPBE/SDD
converged: NO YES NO NO
title: Mulliken charges:
elementType: Cl O N N C C C C C C C C C C C C H H H H H H H H H H H
charge: -0.058410 -0.251458 -0.023133 -0.449409 0.539982 -0.152981 0.518172 -0.597579 -0.317607 -0.195363 -0.356183 0.144791 -0.299600 -0.782862 0.215258 -0.799819 0.243706 0.265856 0.316435 0.259332 0.315226 0.256317 0.230243 0.230248 0.238773 0.271303 0.238761
chargesum: 0.00000
title: Mulliken charges with hydrogens summed into heavy atoms:
elementType: Cl O N N C C C C C C C C C C C C
charge: -0.058410 -0.251458 -0.023133 -0.134183 0.539982 -0.152981 0.518172 -0.353873 -0.051751 -0.195363 -0.039747 0.144791 -0.040267 -0.066054 0.215258 -0.050982
polarizability: 2.79477180e+02 1.40541489e+00 1.70540639e+02 -9.91498233e-04 3.01626411e-05 7.02706856e+01
1716.lowfreq: -79.3133 -7.9615 -5.5233 -0.0018 -0.0014 -0.0002 3.9818 48.5532 56.6711
frequency: -79.3028 48.5521 56.6499 73.9468 108.5983 112.4571 143.0131 182.1904 186.5538 234.6187 241.3918 280.0934 332.2072 381.0356 388.9835 418.1968 465.3718 492.0436 530.5325 538.2774 568.1922 577.6564 597.7529 645.4180 655.8497 683.8212 743.9180 779.4616 803.1108 824.3896 867.8889 874.1259 886.6177 906.1062 952.7635 969.0305 997.3652 1005.5790 1009.3750 1032.0836 1044.4709 1122.8754 1160.7605 1211.2913 1232.9616 1265.2067 1287.6754 1294.3901 1335.5200 1377.3062 1382.6061 1388.9775 1395.2333 1426.6350 1452.4125 1458.5028 1466.1864 1467.7852 1494.9433 1511.2780 1551.4478 1591.9656 1631.6159 1639.5818 2983.4511 2989.0856 3060.7239 3074.1138 3121.2614 3129.0119 3139.6595 3164.5245 3169.3007 3197.0558 3518.9235
redmass: 1.0419 4.7317 5.3491 1.0450 5.9164 3.8135 4.8436 9.5410 4.2606 5.0080 3.3849 6.3525 4.5755 7.8639 4.9278 3.3877 4.7358 4.1332 7.0753 3.1421 4.5179 3.2947 3.8076 6.5156 1.5041 2.3801 5.5860 2.9999 6.3789 5.7065 1.4902 1.4638 1.6278 5.2867 4.0762 2.4648 1.8487 1.8151 1.3097 1.6622 1.5627 1.7815 1.3972 2.4613 1.8904 1.9521 2.5745 3.0818 5.4251 1.2384 3.9208 1.2534 5.5850 2.4190 1.2198 1.1876 1.0464 1.0465 3.2778 2.9639 4.1652 7.1374 6.2310 5.4392 1.0382 1.0385 1.0972 1.0983 1.0981 1.0909 1.0979 1.0906 1.0935 1.0959 1.0764
irintensity: 0.0505 0.0296 12.1494 0.3198 4.2042 0.0073 1.5405 2.2906 2.6140 1.8785 3.3556 0.6080 3.6397 3.2746 2.8228 4.7121 10.7148 9.1573 0.1288 4.1226 9.2767 0.7704 3.5339 12.8620 70.5238 4.4409 11.4622 0.1141 13.5673 22.1664 26.9157 18.4994 67.1135 14.3985 16.8192 14.2681 24.1915 3.0793 1.3956 8.3302 5.8751 0.6991 23.4309 38.0396 50.0880 8.1669 11.9160 117.0949 91.1970 51.4545 129.7881 21.2939 63.8114 228.5158 19.7379 20.3089 16.7860 20.5358 226.2869 169.7836 2.0810 186.1124 148.6732 85.3843 24.3713 7.3693 18.2500 14.2818 7.9347 11.5626 7.1224 4.3824 1.0622 9.6618 10.8554
temp: 298.150 k
press: 1.00000 atm
elementType: 17 8 7 7 6 6 6 6 6 6 6 6 6 6 6 6 1 1 1 1 1 1 1 1 1 1 1
symmnumber: 1
zpe: 534335.7 jmol-1
zpe.correction: 0.203518 hartree
zpe.thermalcorrener: 0.217627 hartree
zpe.thermalcorrenthalpy: 0.218571 hartree
zpe.thermalcorrgfe: 0.161568 hartree
zpe.sumelectzpe: -1107.563657 hartree
zpe.sumelectthermal: -1107.549547 hartree
zpe.sumelectthermalent: -1107.548603 hartree
zpe.sumelectthermalfe: -1107.605606 hartree
dipole: -0.0263 3.6784 0.0001
dipole: 3.6785
quadrupole: -85.9893 -103.4790 -102.9273
quadrupole: 15.8668 0.0004 0.0002
quadrupole: 11.4759 -6.0138 -5.4621 15.8668 0.0004 0.0002
hfenergy: -1107.7671745 hartree
pointgroup: C01 [X(C12H11Cl1N2O1)]
dipole: 0.0397792 1.4466955 -0.0018988 debye
polarizability: 279.4438268|-2.3675106|170.5737881|0.064564|-0.1365971|70.2708896 unknown
InChI: InChI=1S/C12H11ClN2O/c1-7-5-11(13)10-6-9(15-8(2)16)3-4-12(10)14-7/h3-6,15H,1-2H3
charge 0 multiplicity 1
27 atoms
Cl -1.828856 3.184008 -0.00479
O  4.224422 -1.293074 0.003078
N  -2.398735 -1.44383 0.001344
N  2.87533 0.634904 0.000033
C  -0.858527 0.530891 -0.000946
C  -1.122385 -0.899222 0.000935
C  1.559903 0.096293 0.000349
C  0.484052 1.000496 -0.001197
C  -0.002324 -1.788255 0.002452
C  -2.023543 1.365449 -0.002413
C  1.30995 -1.319708 0.002188
C  -3.456234 -0.606307 -0.000103
C  -3.302233 0.82778 -0.002041
C  -4.843441 -1.212965 0.000368
C  4.107404 -0.034096 0.001313
C  5.310898 0.909266 0.000569
H  0.663508 2.082295 -0.00263
H  -0.216287 -2.861146 0.003849
H  2.159779 -2.003883 0.003361
H  -4.187034 1.469902 -0.003166
H  2.926644 1.656969 -0.001283
H  -4.764127 -2.310516 0.0020
H  -5.418919 -0.895244 0.890047
H  -5.418389 -0.897862 -0.890585
H  5.312419 1.556822 -0.895882
H  6.228714 0.304916 0.001909
H  5.311508 1.559417 0.895141
