program: Gaussian 09
title: 000227601
version: EM64L-G09RevD.01
frameworkgroup: C1[X(C10H8ClN3O)]
method: RPBEPBE
basis: SDD
operation: Freq
keyword: #p
keyword: freq=noraman
keyword: PBEPBE/SDD
title: #p freq=noraman PBEPBE/SDD
converged: YES YES NO NO
title: Mulliken charges:
elementType: Cl O N N N C C C C C C C C C C H H H H H H H H
charge: -0.021551 -0.282562 -0.290046 0.118453 -0.642472 0.397339 0.238034 -0.336445 -0.365376 -0.438767 0.533930 -0.432155 -0.227737 -0.207984 -0.243810 0.320095 0.281596 0.260611 0.227843 0.227642 0.229549 0.327094 0.326720
chargesum: 0.00000
title: Mulliken charges with hydrogens summed into heavy atoms:
elementType: Cl O N N N C C C C C C C C C C
charge: -0.021551 -0.282562 -0.290046 0.118453 0.011341 0.397339 0.238034 -0.016351 -0.083780 -0.178156 0.533930 -0.432155 0.000106 0.019658 -0.014261
polarizability: 2.53043374e+02 -1.69028271e+00 1.55264766e+02 -6.46148179e-01 1.29952037e+00 5.39455180e+01
1716.lowfreq: -0.0018 -0.0016 -0.0014 2.3823 5.1695 5.6936 16.2847 50.9217 107.8531
frequency: 15.1971 50.9086 107.8461 135.3098 181.7483 221.5150 246.3703 308.4956 313.4660 350.2259 355.0230 390.2665 408.2382 438.4730 459.1173 502.8883 530.8269 544.3252 584.4052 616.3342 639.7409 667.0365 682.8541 690.8677 696.3004 735.9168 773.4895 839.9502 857.1307 942.8992 955.1618 986.2136 993.1838 1004.6270 1030.1914 1035.2896 1053.9355 1084.6707 1119.1697 1173.4988 1188.6734 1203.2847 1250.0183 1285.3867 1322.5612 1383.7645 1441.8874 1444.7739 1474.4299 1527.4070 1577.3855 1592.4878 1606.0258 1626.6152 1650.1266 3130.6187 3143.0102 3162.8134 3175.6027 3192.9643 3209.9344 3538.5515 3684.9078
redmass: 4.2469 6.1940 8.7958 7.9532 4.9888 5.6798 5.8636 6.7016 7.1093 8.0544 4.9474 5.8846 2.9750 3.1301 1.2968 1.2543 3.3711 7.5851 4.9705 6.4160 8.4866 9.9448 8.6759 3.4533 2.2702 7.3169 1.6363 1.6397 1.2464 1.4158 5.6192 6.0370 1.3494 1.3032 2.5113 2.9688 1.8038 1.9276 3.2203 1.0471 1.3204 2.2649 3.8510 2.2772 1.3346 9.7805 4.2479 2.6175 2.1946 9.6917 4.0142 5.8031 6.1382 1.8496 3.5868 1.0855 1.0913 1.0985 1.0920 1.0939 1.0944 1.0458 1.1040
irintensity: 0.0158 8.8269 0.1370 1.1834 0.0153 1.5140 4.3003 7.0695 1.0971 2.7766 6.2822 2.3381 0.0229 34.3862 12.7906 233.6730 21.1453 23.0150 7.9892 0.6644 26.4472 0.2502 6.0269 6.0584 36.7118 15.0085 75.9062 50.9827 0.2951 11.2840 44.2423 0.0990 0.2332 3.1123 18.9008 42.2973 45.7361 10.2769 70.6862 0.4281 2.5678 14.8351 102.5339 29.3025 1.2934 4.7161 93.0292 47.4806 123.1032 13.5426 62.1850 29.3481 27.8682 100.9292 489.4310 0.0142 22.7287 34.7782 3.0740 2.6740 17.6767 131.9150 45.3003
temp: 298.150 k
press: 1.00000 atm
elementType: 17 8 7 7 7 6 6 6 6 6 6 6 6 6 6 1 1 1 1 1 1 1 1
symmnumber: 1
zpe: 433863.7 jmol-1
zpe.correction: 0.165250 hartree
zpe.thermalcorrener: 0.177855 hartree
zpe.thermalcorrenthalpy: 0.178800 hartree
zpe.thermalcorrgfe: 0.124722 hartree
zpe.sumelectzpe: -1084.334978 hartree
zpe.sumelectthermal: -1084.322372 hartree
zpe.sumelectthermalent: -1084.321428 hartree
zpe.sumelectthermalfe: -1084.375506 hartree
dipole: 3.9477 -0.5501 -0.0054
dipole: 3.9859
quadrupole: -63.4797 -97.0742 -98.1952
quadrupole: 11.5568 -0.4088 0.7262
quadrupole: 22.7700 -10.8245 -11.9455 11.5568 -0.4088 0.7262
hfenergy: -1084.5002277 hartree
pointgroup: C01 [X(C10H8Cl1N3O1)]
dipole: -1.5111654 0.4125783 -0.0729208 debye
dipolederiv: -0.4004394 0.2568086 -0.031823 0.4858763 -0.634 0.0654308 -0.0580125 0.062659 -0.0779036 -0.6557261 0.3553663 -0.0386404 0.2904441 -1.1362507 0.0839503 -0.0399603 0.0846691 -0.3650977 -0.5886214 -0.3273459 0.0222791 0.6300742 -0.6453316 0.0837995 -0.0886702 0.0608772 -0.0457224 0.0698387 0.1973428 -0.0187655 -0.8160312 -0.1708955 -0.0014733 0.123428 0.0160141 -0.0435152 -1.7303045 0.2451725 -0.0424763 0.015319 -0.2009896 -0.0489425 -0.019877 -0.0445412 -0.6579137 0.9337802 0.113551 -0.0011312 0.0641126 0.0213878 -0.0065712 -0.0049804 -0.0020173 0.0492707 0.849523 -0.3381221 0.0464512 -0.2348564 1.4340893 -0.1270436 0.0337121 -0.1330381 0.2321402 -0.2456491 0.0472363 -0.0090719 -0.0319724 -0.062759 -0.0163752 0.0042717 -0.0067312 -0.1431924 -0.1284179 -0.0714067 0.0102607 -0.0592801 -0.0638233 -0.0182225 0.0062897 -0.0152511 -0.1526562 -0.5817747 0.2888209 -0.0338363 0.4065631 -0.2257163 0.0033485 -0.0464313 0.0032476 -0.2556166 1.7592589 -0.097684 0.035984 0.2046068 0.1565351 0.007728 0.0062585 0.0024598 0.1946449 -0.0974074 -0.6317124 0.067068 -0.9552867 0.9563836 -0.1166536 0.0922216 -0.1133855 -0.015823 0.0882381 -0.1142811 0.0248805 -0.1332752 0.0690547 -0.0473031 0.0356475 -0.0408532 -0.1493654 -0.1167219 0.0597211 -0.0075498 0.1536236 0.1350744 -0.0529536 -0.0272893 -0.0524616 -0.1480942 0.0277793 0.0190985 -0.0001253 -0.0722698 -0.069515 -0.0152958 0.0204348 -0.0162018 -0.1563579 0.2441182 -0.0356645 0.0090194 0.0185617 0.0764732 0.0237087 0.006697 0.0160539 0.1788481 0.1194387 0.0744624 -0.0173509 0.0875781 0.0405241 0.0261016 -0.0242586 0.0234858 0.1623775 0.0138082 -0.0361947 0.0006048 -0.0606087 0.0042806 0.0177392 0.0002141 0.0192523 0.1834233 -0.022016 0.08733 -0.0207915 0.1180578 -0.0309258 0.0376875 -0.0272449 0.035614 0.1475236 0.0353101 -0.0600687 0.0088965 -0.0955455 -0.0883698 0.0440802 0.0142545 0.0438289 0.1476965 -0.1450946 -0.0334545 -0.0003903 -0.0414903 0.09221 0.0127832 -0.000587 0.012101 0.1622507 0.2673756 0.0063637 -0.0029283 0.0712164 0.115564 0.029204 -0.0089604 0.0284468 0.3798859 0.303704 -0.0053394 -0.0005634 -0.0454175 0.227 0.0152725 0.0028422 0.0157715 0.373197 unknown
polarizability: 250.8730145|-13.8524439|155.4731742|4.7918939|-14.0288098|55.9074697 unknown
InChI: InChI=1S/C10H8ClN3O/c11-10-8(12)6-9(15)14(13-10)7-4-2-1-3-5-7/h1-6H,12H2
charge 0 multiplicity 1
23 atoms
Cl -2.949431 2.596955 -0.314456
O  -0.144313 -2.565502 0.278414
N  -0.10561 -0.183815 0.028998
N  -0.814642 0.985231 -0.107549
N  -4.323001 -0.118754 -0.056699
C  1.340891 -0.000882 0.023894
C  -0.786762 -1.479172 0.151822
C  2.234541 -1.082008 0.247022
C  1.85633 1.302911 -0.2082
C  -2.233488 -1.405026 0.115712
C  -2.950932 -0.215084 -0.021801
C  -2.119264 0.969397 -0.130308
C  3.627106 -0.842843 0.234097
C  3.247537 1.519339 -0.217304
C  4.145856 0.448932 0.003564
H  1.842993 -2.083923 0.418055
H  1.164567 2.130103 -0.3756
H  -2.742787 -2.368196 0.206175
H  4.306018 -1.685135 0.4072
H  3.62899 2.530228 -0.398734
H  5.227502 0.62128 -0.005009
H  -4.903507 -0.949752 0.020243
H  -4.767695 0.791719 -0.160435
