program: Gaussian 09
title: 000227597
version: EM64L-G09RevD.01
frameworkgroup: C1[X(C5H4N4O)]
method: RPBEPBE
basis: SDD
operation: Freq
keyword: #pfreq=noraman
keyword: PBEPBE/SDD
title: #p freq=noraman PBEPBE/SDD
converged: NO NO NO YES
title: Mulliken charges:
elementType: O N N N N C C C C C H H H H
charge: -0.231511 -0.370808 -0.208846 -0.067931 -0.100376 -0.031163 0.087873 0.218155 -0.223442 -0.302588 0.285208 0.344358 0.344860 0.256211
chargesum: 0.00000
title: Mulliken charges with hydrogens summed into heavy atoms:
elementType: O N N N N C C C C C
charge: -0.231511 -0.026450 0.136014 -0.067931 -0.100376 -0.031163 0.087873 0.218155 0.061766 -0.046377
polarizability: 1.19737705e+02 6.87452485e+00 9.99595423e+01 -9.79203776e-03 -9.01523571e-03 3.42636169e+01
1716.lowfreq: -12.7089 -8.6982 0.0004 0.0009 0.0009 9.4694 136.4749 207.1728 213.9280
frequency: 136.4731 207.1720 213.9219 304.1783 359.7139 466.0687 490.7361 499.1489 562.8820 573.9355 621.0633 647.7432 658.2445 752.3300 865.8682 869.0894 885.0034 885.2296 996.3561 1018.0930 1090.3922 1175.2030 1216.3879 1254.7045 1312.4742 1317.4433 1375.5532 1399.5876 1430.5592 1532.8931 1619.1258 1679.3021 3202.1486 3229.4474 3532.6911 3556.9458
redmass: 9.9189 4.9106 4.8279 10.0312 1.4524 7.4478 2.7947 10.0549 1.1963 5.7624 4.1149 5.4891 8.3385 10.6693 5.3098 1.4234 5.0949 1.5976 5.9714 2.9985 3.5566 5.2737 2.7005 2.2179 2.0147 3.2797 2.7521 1.5218 6.3366 1.9839 7.5006 7.2823 1.0956 1.0974 1.0804 1.0811
irintensity: 1.9755 3.4158 17.3322 4.4200 0.5970 2.1751 2.0142 5.6432 212.0907 0.3149 42.7981 31.0346 4.5871 1.8385 25.0895 1.3708 6.0014 29.1092 9.0614 102.7549 26.1775 33.4676 33.9414 22.7258 23.0447 48.6008 18.5232 10.2518 0.1049 14.3680 186.7662 364.5518 2.5085 8.0940 48.9593 184.4960
temp: 298.150 k
press: 1.00000 atm
elementType: 8 7 7 7 7 6 6 6 6 6 1 1 1 1
symmnumber: 1
zpe: 250845.6 jmol-1
zpe.correction: 0.095542 hartree
zpe.thermalcorrener: 0.102901 hartree
zpe.thermalcorrenthalpy: 0.103846 hartree
zpe.thermalcorrgfe: 0.063574 hartree
zpe.sumelectzpe: -486.405697 hartree
zpe.sumelectthermal: -486.398337 hartree
zpe.sumelectthermalent: -486.397393 hartree
zpe.sumelectthermalfe: -486.437665 hartree
dipole: 5.4246 7.2980 0.0013
dipole: 9.0932
quadrupole: -48.5480 -60.3283 -58.3221
quadrupole: 14.8199 -0.0058 -0.0008
quadrupole: 7.1848 -4.5955 -2.5893 14.8199 -0.0058 -0.0008
hfenergy: -486.5012389 hartree
pointgroup: C01 [X(C5H4N4O1)]
dipole: -1.9587377 -2.9937034 0.0005109 debye
dipolederiv: -0.7195933 0.4653989 0.0000509 0.484515 -1.0241497 -0.000089 -0.0001989 0.0002381 -0.3451851 -0.3543642 -0.2618731 0.0000385 0.5263092 -0.2552124 0.0000599 0.0000393 -0.0000552 -0.3702589 -0.5976548 -0.6083965 -0.000131 -0.6229664 -0.3791865 -0.0000325 0.0002081 0.0000387 -0.1607797 -0.7406611 -0.4550675 0.0002152 -0.0206538 -0.3429587 -0.0002355 -0.000565 -0.0004097 -0.2450218 -0.2579513 0.2262029 0. 0.1599537 -0.2330473 0.0003573 -0.0002303 -0.00041 -0.2721665 -0.3790319 0.4909794 -0.0001416 0.6642044 0.3595403 -0.000148 0.0001464 0.000262 0.0326765 -0.0141255 -0.279378 -0.0003224 -0.7277589 -0.5254375 -0.0000967 0.000336 0.000181 0.0116003 0.9056626 -0.4009435 0.0000147 -0.5935346 1.5699905 0.0000719 -0.0000027 -0.0001996 0.2799094 0.9346508 0.5977923 0.0001936 0.3367615 0.3589343 0.0001152 -0.0001209 0.0002378 0.0097688 0.6095083 0.2211241 0.000175 -0.2700406 -0.015725 0.0000914 -0.0003286 -0.000019 -0.0365168 0.1128684 -0.0116607 0.0000067 -0.0048366 0.0341706 -0.0000244 -0.0001037 -0.0002073 0.1860122 0.28045 -0.0150581 -0.0000085 0.0040349 0.1552839 -0.0000216 0.0000155 -0.0000488 0.3770388 0.2522733 0.0726837 -0.0000083 0.1092234 0.2110349 0.0000009 0.0000148 0.0000018 0.3701245 -0.0320315 -0.0418039 -0.000083 -0.0452111 0.0867624 -0.000049 0.0007897 0.0003901 0.1627982 unknown
polarizability: 118.8465246|8.0056726|100.8507224|0.0092356|0.0095845|34.2636169 unknown
InChI: InChI=1S/C5H4N4O/c10-5-4-3(1-8-9-5)6-2-7-4/h1-2,8-9H
charge 0 multiplicity 1
14 atoms
O  -1.861348 1.966887 -0.000202
N  -1.998976 -0.343127 -0.000127
N  -1.491353 -1.646282 -0.000213
N  1.263342 1.453562 -0.000479
N  2.104404 -0.757378 -0.001136
C  0.205964 0.593339 -0.000158
C  0.705558 -0.781186 -0.000287
C  -1.223565 0.883247 0.000093
C  -0.152242 -1.882082 -0.000222
C  2.370121 0.581879 0.000785
H  0.173353 -2.923517 -0.000508
H  -3.018428 -0.242873 -0.000245
H  -2.181934 -2.398946 -0.000437
H  3.387004 0.972179 0.000336
