program: Gaussian 09
title: 000227583
version: EM64L-G09RevD.01
frameworkgroup: C1[X(C10H10ClN3O)]
method: RPBEPBE
basis: SDD
operation: Freq
keyword: #p
keyword: freq=noraman
keyword: PBEPBE/SDD
title: #p freq=noraman PBEPBE/SDD
converged: YES YES NO NO
title: Mulliken charges:
elementType: Cl O N N N C C C C C C C C C C H H H H H H H H H H
charge: -0.074051 -0.378943 0.034442 -0.245599 -0.665155 0.340814 -0.196708 0.618638 0.021484 -0.602234 -0.450754 -0.385594 -0.310906 -0.177759 -0.375790 0.239897 0.262500 0.252203 0.266069 0.272081 0.229833 0.243014 0.424994 0.318671 0.338852
chargesum: 0.00000
title: Mulliken charges with hydrogens summed into heavy atoms:
elementType: Cl O N N N C C C C C C C C C C
charge: -0.074051 0.046051 0.034442 0.026481 -0.007631 0.340814 -0.196708 0.618638 0.021484 -0.099837 -0.198551 -0.385594 -0.044837 0.052074 -0.132775
polarizability: 2.04070646e+02 -1.11365053e+01 1.75230969e+02 7.33681324e+00 -1.49423694e+00 6.96903450e+01
1716.lowfreq: -4.4813 -0.0018 -0.0017 -0.0016 4.8992 8.2655 61.3885 71.4754 116.9570
frequency: 61.3792 71.4689 116.9550 127.3592 174.4176 202.2653 207.3079 271.7564 291.2276 336.1394 350.3744 358.8468 413.8885 422.9366 431.1841 472.3395 492.8574 558.5281 584.6157 601.8610 605.1760 625.2040 695.7894 698.6608 765.7226 808.1759 835.7155 875.9621 887.1128 899.0543 932.3222 939.2202 962.4976 990.3557 1031.9539 1039.7497 1077.9847 1118.5034 1158.7900 1172.2686 1205.9009 1216.3057 1238.8036 1251.0029 1294.6235 1306.7428 1328.2995 1367.0227 1375.4992 1395.1610 1427.0578 1445.3328 1465.6225 1488.5826 1523.4209 1548.6411 1590.5843 1615.8197 1654.3331 2500.6505 3000.4434 3067.3644 3122.0939 3141.4139 3148.8539 3170.9706 3364.6833 3416.2589 3491.6638
redmass: 3.6685 5.3472 4.9790 4.3330 6.9892 7.3274 4.4980 2.9380 4.8307 5.3850 8.7619 4.8128 1.5975 3.9097 2.6248 4.6189 4.4224 5.6388 3.3947 4.5616 1.9273 5.0847 6.5906 4.8407 5.7899 1.6444 4.0312 1.9306 2.0678 3.3967 2.0438 1.4307 3.4973 1.3596 2.0927 2.3316 3.2785 1.7608 1.3368 1.4946 1.4899 1.3948 2.4507 1.9321 1.9153 3.6675 1.2776 2.6281 2.3146 3.5598 2.5820 1.1117 1.1380 3.3109 5.4086 2.0461 5.7799 3.0416 1.0978 1.0772 1.0614 1.1020 1.0894 1.0919 1.0894 1.0997 1.0471 1.0758 1.0954
irintensity: 8.7401 6.0237 1.1681 3.5997 7.2360 4.7960 5.0642 1.5494 2.0435 22.1804 3.6265 17.4477 20.8065 15.3331 3.9467 4.2887 1.5857 5.1342 5.8293 3.4359 84.7926 46.4663 22.1627 13.2279 22.2241 34.3640 17.7648 58.3684 26.4250 47.1540 102.0799 0.1035 77.3619 0.6857 17.7647 1.8114 21.8803 54.0561 18.3793 19.3041 23.0693 16.5092 27.7002 7.0136 64.5250 23.2620 3.1117 130.8597 46.2114 6.0189 103.7397 23.4349 2.7375 8.2526 32.5579 9.4816 20.6038 18.0935 24.1742 1662.3914 28.3284 8.9062 21.6441 3.4833 9.8050 21.9472 1.7522 0.1197 6.4205
temp: 298.150 k
press: 1.00000 atm
elementType: 17 8 7 7 7 6 6 6 6 6 6 6 6 6 6 1 1 1 1 1 1 1 1 1 1
symmnumber: 1
zpe: 495439.9 jmol-1
zpe.correction: 0.188703 hartree
zpe.thermalcorrener: 0.201481 hartree
zpe.thermalcorrenthalpy: 0.202425 hartree
zpe.thermalcorrgfe: 0.149306 hartree
zpe.sumelectzpe: -1085.487384 hartree
zpe.sumelectthermal: -1085.474606 hartree
zpe.sumelectthermalent: -1085.473662 hartree
zpe.sumelectthermalfe: -1085.526781 hartree
dipole: -2.8309 1.3530 2.5603
dipole: 4.0496
quadrupole: -72.0825 -100.7262 -92.6088
quadrupole: -7.2149 -7.9784 -3.2367
quadrupole: 16.3900 -12.2537 -4.1363 -7.2149 -7.9784 -3.2367
hfenergy: -1085.676087 hartree
pointgroup: C01 [X(C10H10Cl1N3O1)]
dipole: -1.2555374 -0.2000627 -0.9602238 debye
dipolederiv: -0.2438729 0.3010404 0.0393202 0.2243793 -0.8121311 -0.0695219 0.042998 -0.1019771 -0.0822981 -1.2478867 0.650131 -0.0487235 0.697719 -0.9911143 -0.0685474 0.010424 -0.1221974 -0.4222523 -0.3538636 -0.0976962 0.0045408 0.0492908 -0.4052017 -0.0223787 0.0071768 0.0116861 -0.2174509 -0.8788095 -0.0446268 0.0741875 0.1367239 -0.0123375 0.0298352 0.0741561 -0.0672475 -0.0833927 -0.5371004 -0.0206013 -0.203993 -0.1752594 -0.1274537 -0.0717031 -0.4148609 0.0811606 -0.3087299 -0.1673541 -0.1227123 -0.091206 0.3481058 -0.3272288 -0.0090587 -0.028112 -0.0031191 -0.205458 0.1730985 0.3677077 0.0032382 -0.1492029 0.0768136 0.0354013 -0.0525136 -0.0139753 0.0188069 -0.1039429 0.1020098 0.0342327 0.4566836 -0.2344673 -0.0735366 0.07107 -0.0379292 0.1045514 0.4021701 -0.5108444 -0.077012 -0.831026 0.9456238 0.0804313 -0.0740814 0.1249125 0.071235 0.7500868 0.0119858 0.0199944 -0.0300559 0.1274287 -0.0320987 0.1142859 -0.0800192 0.333862 0.1159945 0.0516762 -0.019172 -0.2029159 -0.0469553 0.0100262 -0.0611342 -0.0128141 -0.077326 -0.0725418 -0.4295104 -0.0511993 -0.4189185 1.0468874 0.1270098 -0.015507 0.151202 -0.1194549 0.0556246 0.042745 -0.0260155 -0.0765988 0.1263466 0.0279709 -0.0370477 -0.0002909 -0.1279734 0.0780347 -0.0398331 -0.0342089 -0.0823961 -0.2348435 0.0034583 -0.0288006 -0.0006173 -0.1030078 0.1263777 0.0742662 -0.0239505 0.0970889 0.4181331 0.017945 -0.0199301 0.0188877 -0.0677163 0.0187748 -0.0106457 -0.0129426 -0.0826562 -0.0952724 0.0830891 -0.0248363 0.0232579 0.0868668 -0.0522335 0.0066171 0.0032727 0.074069 0.0458203 -0.1298545 0.0067661 -0.0432388 -0.0355903 0.0475981 -0.0929337 0.0181071 -0.0632704 -0.0094885 0.0048413 0.0072226 0.0178659 0.1457173 0.0743958 0.0246433 0.0120975 0.0874754 0.0076671 -0.0209975 0.0144433 -0.0119451 0.1466814 0.3752546 0.0812904 0.0326983 0.0157045 0.0264051 -0.0247969 -0.0788654 -0.0343272 0.005712 -0.1273337 -0.0222051 0.0402477 -0.0028185 0.0974744 -0.0032457 0.042444 0.0003085 0.1528951 -0.0033102 -0.10267 0.011514 -0.1231806 -0.0748977 0.0053012 0.0142665 0.0027832 0.1274123 1.1856613 -0.2881492 0.2097311 0.0062606 0.2258553 0.0089838 0.3302686 -0.0342817 0.3806318 0.2786214 -0.0213306 0.0692048 0.0221669 0.079954 0.0363974 0.1217451 0.0461243 0.0564277 0.1065564 0.0896459 0.0160363 0.0226313 0.1469824 0.0550486 -0.0215775 0.0857912 0.2198508 unknown
polarizability: 206.9221509|2.2781025|171.5160721|-12.9950119|1.8897345|70.5537362 unknown
InChI: InChI=1S/C10H10ClN3O/c11-8-4-6(5-14-12)10(15)9-7(8)2-1-3-13-9/h1-4,14-15H,5,12H2
charge 0 multiplicity 1
25 atoms
Cl 1.334804 -3.411134 -0.281283
O  -1.35751 1.965054 0.45789
N  1.378915 1.895368 0.048613
N  -3.955718 0.062356 -0.218812
N  -3.68582 1.444702 -0.616951
C  -1.48795 -0.469922 0.378939
C  0.683002 0.700232 0.085586
C  1.344971 -0.585001 -0.095211
C  -0.749992 0.740255 0.305259
C  -2.96453 -0.440566 0.778123
C  -0.822972 -1.71909 0.192065
C  0.546129 -1.766751 -0.045993
C  2.762085 -0.57513 -0.309616
C  3.446218 0.640025 -0.336929
C  2.709269 1.852855 -0.152786
H  -3.300908 -1.459779 1.039705
H  -3.085633 0.184204 1.682782
H  -1.396662 -2.650182 0.257032
H  3.284997 -1.526693 -0.446114
H  -4.029866 -0.553919 -1.042196
H  4.528235 0.678615 -0.496959
H  3.224168 2.821076 -0.172824
H  -2.373438 1.888853 0.191839
H  -3.324225 1.535434 -1.581387
H  -4.540667 2.005339 -0.502571
