program: Gaussian 09
title: 000227582
version: EM64L-G09RevD.01
frameworkgroup: C1[X(C21H20N2)]
method: RPBEPBE
basis: SDD
operation: Freq
keyword: #pfreq=noraman
keyword: PBEPBE/SDD
title: #p freq=noraman PBEPBE/SDD
converged: YES YES NO NO
title: Mulliken charges:
elementType: N N C C C C C C C C C C C C C C C C C C C C C H H H H H H H H H H H H H H H H H H H H
charge: -0.150134 -0.004446 0.274988 0.445991 -0.465999 0.390207 0.290320 0.239314 -0.370036 -0.430952 -0.366790 -0.377446 -0.415723 -0.388780 -0.340540 -0.344078 -0.646606 -0.645129 -0.236242 -0.233651 -0.251206 -0.347284 -0.349087 0.224854 0.253057 0.226456 0.239244 0.236284 0.245398 0.251167 0.260770 0.253717 0.235687 0.217495 0.238763 0.218070 0.234840 0.236415 0.223628 0.225228 0.228258 0.237092 0.236886
chargesum: 0.00000
title: Mulliken charges with hydrogens summed into heavy atoms:
elementType: N N C C C C C C C C C C C C C C C C C C C C C
charge: -0.150134 -0.004446 0.274988 0.445991 -0.241145 0.390207 0.290320 0.239314 -0.116979 -0.204496 -0.127546 -0.141162 -0.170326 -0.137613 -0.079770 -0.090361 0.045339 0.044196 -0.012614 -0.008423 -0.022948 -0.110192 -0.112201
polarizability: 4.72008137e+02 2.39974786e+00 2.54041192e+02 8.99737274e+00 -1.70778260e+00 1.47947912e+02
1716.lowfreq: -7.1495 -0.0005 -0.0003 -0.0001 1.0489 4.4577 24.5556 29.2156 35.0157
frequency: 24.4486 29.0616 34.7977 59.1378 66.9613 70.1225 80.8669 96.9133 116.0425 131.3449 182.2771 196.7087 207.9709 218.4466 245.4146 263.6752 284.6465 308.7463 371.9951 394.4591 395.5538 410.9887 420.6757 461.3827 468.0956 492.6465 521.7288 535.1042 569.1237 614.5115 627.7445 629.8056 647.9452 663.8219 702.8986 712.4941 727.4083 740.8419 755.3467 769.3748 803.0310 815.8246 821.6306 838.6394 852.2549 886.8859 889.0357 920.8633 934.1315 943.4659 950.6507 957.1880 958.6918 968.0244 974.1704 977.6766 987.7856 993.0205 995.8597 1028.7656 1056.5652 1062.6284 1082.6881 1085.9811 1106.9902 1109.9746 1133.1155 1149.6532 1166.7242 1172.0973 1194.1378 1207.1727 1219.3189 1242.7872 1259.9958 1268.7834 1288.6686 1314.4957 1326.8013 1330.1324 1359.7589 1364.9799 1375.3801 1393.5394 1400.8793 1429.1809 1435.2738 1445.9317 1458.0882 1463.8037 1465.1653 1475.0287 1481.2395 1492.7788 1505.0885 1525.0816 1532.3326 1547.4871 1575.9572 1577.3680 1589.0484 1609.7822 1631.5708 2940.8986 2948.6895 3007.4606 3011.1554 3080.6194 3096.6151 3106.6214 3114.0562 3121.2496 3125.8886 3128.1651 3128.9584 3141.8143 3149.2981 3149.5821 3155.7234 3163.6345 3163.8663 3164.0206 3172.2214
redmass: 4.0945 4.0771 4.0161 3.9342 3.5473 5.2134 2.7764 3.2172 1.6477 4.2870 2.9019 1.1989 3.6989 4.1408 4.4417 3.4711 4.6698 4.2232 2.5224 3.8488 3.6825 2.9801 3.0304 3.9124 3.8813 3.8199 3.0005 2.9134 4.6536 5.8947 6.4000 4.0962 5.2754 6.4950 1.7454 4.4651 4.0140 4.1153 3.1469 2.0577 1.2979 2.0173 2.1208 2.1565 1.2729 1.4234 1.2819 1.7005 2.4428 2.9809 1.5631 1.3866 6.2512 1.4179 1.4782 1.4558 4.4057 1.3816 2.7680 2.1756 1.4999 2.2518 1.6376 1.6136 1.2392 1.3220 1.7984 2.4406 1.7108 1.0531 1.1185 1.1540 1.2619 1.7146 2.9019 3.3045 4.4603 1.5431 1.4838 1.5012 2.6027 3.0704 6.4022 2.2341 2.0056 1.3268 2.2347 2.4879 1.2387 1.0418 2.0286 1.0464 2.2808 1.1028 1.1440 2.7989 5.5309 6.1347 5.5645 5.5637 6.5969 6.2746 6.1585 1.0370 1.0394 1.0995 1.1022 1.0871 1.0963 1.0942 1.0893 1.0843 1.0874 1.0873 1.0899 1.0920 1.0960 1.0866 1.0958 1.0938 1.0975 1.1002 1.0957
irintensity: 0.4631 0.9364 0.7011 0.2457 0.3890 0.3431 0.5443 3.4830 0.7873 0.5721 0.9242 0.0899 0.2174 1.7874 1.2489 0.9765 1.0057 3.2029 0.4248 0.4131 0.9543 0.2859 1.9088 10.9825 0.9217 1.4573 17.8591 18.9812 15.5866 1.6835 4.8911 8.1375 13.8535 0.5373 50.5123 4.1243 4.1103 3.5292 6.4035 45.9365 3.2982 20.5374 71.9505 12.5770 0.3808 23.2968 6.5425 3.7116 5.7551 27.3309 6.6664 0.6970 4.1363 1.0390 0.3774 0.4441 0.2870 0.2316 0.1178 10.2544 25.0031 3.8349 0.6489 8.3200 0.0494 2.2299 6.8812 19.4118 4.7710 0.1175 0.5116 97.0314 4.9477 5.9961 28.0635 0.0360 1.9835 1.1596 2.3850 4.3553 1.7429 228.9566 13.8588 31.7198 18.1607 14.7968 15.3928 10.6733 23.2734 0.0792 5.4872 22.5526 29.4395 2.6942 37.3747 286.0009 79.2846 3.2679 15.3071 112.5330 199.1888 5.2369 356.7409 106.4017 170.4325 14.1155 69.5012 26.9139 4.2268 51.9416 13.6622 5.7580 22.3913 1.1823 16.2980 18.6238 38.0150 9.0779 24.0589 36.3576 8.8627 21.4032 11.0703
temp: 298.150 k
press: 1.00000 atm
elementType: 7 7 6 6 6 6 6 6 6 6 6 6 6 6 6 6 6 6 6 6 6 6 6 1 1 1 1 1 1 1 1 1 1 1 1 1 1 1 1 1 1 1 1
symmnumber: 1
zpe: 919528.3 jmol-1
zpe.correction: 0.350230 hartree
zpe.thermalcorrener: 0.370734 hartree
zpe.thermalcorrenthalpy: 0.371678 hartree
zpe.thermalcorrgfe: 0.298915 hartree
zpe.sumelectzpe: -920.105884 hartree
zpe.sumelectthermal: -920.085380 hartree
zpe.sumelectthermalent: -920.084435 hartree
zpe.sumelectthermalfe: -920.157199 hartree
dipole: 4.5187 -2.8182 -0.2854
dipole: 5.3332
quadrupole: -95.7451 -144.1820 -135.1176
quadrupole: 2.9527 2.0808 -2.1254
quadrupole: 29.2698 -19.1671 -10.1027 2.9527 2.0808 -2.1254
hfenergy: -920.4561139 hartree
pointgroup: C01 [X(C21H20N2)]
dipole: 1.6751392 -1.2634379 0.0133316 debye
polarizability: 470.1820247|-15.5752766|254.3933515|17.1083693|-10.2924861|149.4218635 unknown
InChI: InChI=1S/C21H20N2/c1-23(2)20-10-8-17(9-11-20)16-21(18-6-4-3-5-7-18)19-12-14-22-15-13-19/h3-16H,1-2H3
charge 0 multiplicity 1
43 atoms
N  5.33335 -0.828641 0.050138
N  -0.759401 4.178569 -0.162648
C  -1.427359 -0.141005 0.037951
C  1.03933 -0.947321 0.164175
C  -0.421676 -1.073684 0.228578
C  3.937865 -0.876596 0.079815
C  -2.847502 -0.599367 -0.038637
C  -1.179694 1.332134 -0.046031
C  1.743128 0.073966 -0.543543
C  1.83782 -1.950404 0.791421
C  3.143508 0.113139 -0.589061
C  3.240229 -1.922884 0.766207
C  -3.182913 -1.867768 -0.597636
C  -3.91196 0.210021 0.454986
C  -0.397288 2.012036 0.928061
C  -1.758578 2.130984 -1.070134
C  6.018619 0.243553 -0.683897
C  6.120525 -1.866151 0.728711
C  -4.518834 -2.319367 -0.633153
C  -5.248399 -0.239762 0.415628
C  -5.561186 -1.509277 -0.124634
C  -0.218467 3.407729 0.831662
C  -1.518594 3.522623 -1.092568
H  -0.762554 -2.094435 0.459315
H  1.182233 0.841134 -1.084891
H  1.33593 -2.769714 1.322473
H  3.625873 0.912771 -1.158146
H  3.794052 -2.717713 1.273349
H  -2.391868 -2.486728 -1.035906
H  -3.685751 1.19046 0.888198
H  0.061813 1.453983 1.749745
H  -2.384361 1.670697 -1.841691
H  5.778594 0.223333 -1.766683
H  7.108002 0.123017 -0.576537
H  5.74716 1.244949 -0.293537
H  7.193181 -1.642426 0.618908
H  5.936346 -2.873157 0.300904
H  5.891697 -1.909493 1.812733
H  -4.749752 -3.296114 -1.073786
H  -6.04635 0.398781 0.811549
H  -6.599776 -1.856723 -0.158368
H  0.376912 3.946444 1.577895
H  -1.948205 4.149906 -1.882313
