program: Gaussian 09
title: 000227579
version: EM64L-G09RevD.01
frameworkgroup: C1[X(C15H15NO)]
method: RPBEPBE
basis: SDD
operation: Freq
keyword: #p
keyword: freq=noraman
keyword: PBEPBE/SDD
title: #p freq=noraman PBEPBE/SDD
converged: YES YES NO NO
title: Mulliken charges:
elementType: O N C C C C C C C C C C C C C C C H H H H H H H H H H H H H H H
charge: -0.438836 -0.003318 0.355743 -0.546289 0.336862 -0.433097 0.438796 -0.696881 -0.346266 -0.332767 -0.519025 -0.415742 0.292445 -0.208416 -0.407314 -0.349456 -0.351092 0.250330 0.202733 0.227372 0.237872 0.218648 0.226713 0.232668 0.234501 0.258553 0.252599 0.226577 0.223447 0.238204 0.238786 0.355650
chargesum: 0.00000
title: Mulliken charges with hydrogens summed into heavy atoms:
elementType: O N C C C C C C C C C C C C C C C
charge: -0.083186 -0.003318 0.355743 -0.093226 0.336862 -0.205726 0.438796 -0.013648 -0.113598 -0.098266 -0.260471 -0.163144 0.292445 0.018161 -0.183867 -0.111251 -0.112306
polarizability: 2.97909679e+02 8.10749458e-01 1.65831306e+02 -3.96848031e+00 -2.05541343e+01 9.63459306e+01
1716.lowfreq: -10.7338 -4.1646 -0.0008 -0.0007 -0.0006 2.0574 28.9157 46.8648 60.9093
frequency: 28.4579 46.8517 60.8780 76.4457 111.6967 121.4134 186.8736 204.7166 230.2042 235.0985 245.9405 274.5351 329.3529 361.9414 372.4517 402.2442 444.3916 459.2621 492.1804 515.0424 540.9390 581.3810 619.4504 652.1351 661.8267 693.5652 732.9316 747.3244 758.6724 781.6529 797.4026 826.0452 865.8798 878.3370 881.2312 899.9698 916.8690 951.0763 960.7315 962.9218 965.9181 973.5677 982.6664 1029.4331 1061.2950 1067.2488 1088.3592 1091.4778 1106.2505 1142.7809 1173.9201 1187.8902 1226.0834 1243.2609 1259.2398 1279.9228 1293.2057 1308.5158 1326.4067 1330.7546 1356.0463 1389.7088 1395.0866 1405.2077 1455.6039 1466.7746 1475.1738 1476.0405 1477.3138 1489.2642 1534.8976 1579.6075 1581.2140 1623.9781 1631.1361 2971.0520 2987.1427 3067.4352 3081.8884 3089.3267 3095.3219 3118.0888 3126.3953 3128.1647 3143.6647 3152.8174 3153.3531 3158.4936 3169.4555 3583.4866
redmass: 4.4457 4.5850 3.9498 3.9596 2.6205 4.1350 2.7402 1.7186 3.7090 3.6150 4.7513 2.9203 3.2483 1.1091 2.5149 3.4947 3.2465 3.9826 3.7652 6.7522 4.5747 3.6433 3.0958 5.2134 6.9088 2.2291 3.1183 3.2585 3.7940 1.6363 1.4262 1.4239 1.4606 1.4610 1.2743 1.7516 2.5357 2.1379 3.1095 1.3906 1.7290 1.5340 5.7245 2.6591 2.1556 1.8732 1.7095 1.6584 1.7491 1.3924 1.1742 1.3803 1.2516 1.6200 1.8878 2.7642 2.8819 1.7649 1.3871 1.5175 1.9151 1.8246 1.8378 2.0188 2.6129 1.9911 1.0728 1.1027 2.4056 1.0723 6.6955 5.6364 6.0223 6.2155 7.7219 1.0684 1.0354 1.0922 1.1000 1.0872 1.0988 1.0883 1.0869 1.0892 1.0916 1.0922 1.0946 1.0977 1.0970 1.0660
irintensity: 0.1497 0.1394 0.3638 0.1582 0.0125 2.3719 0.9905 1.1435 3.1923 1.3463 2.1374 1.0256 6.0668 143.1638 0.1895 3.4523 1.8624 5.9030 22.6992 3.3093 6.1104 0.8400 4.4969 1.8658 1.0494 31.4849 18.7452 3.5071 10.8861 37.7717 15.1783 71.8812 2.9392 3.6676 2.3988 37.8980 44.3150 15.5178 2.9218 1.0991 5.6586 1.4102 2.2689 2.1593 7.8982 4.8688 4.8793 12.5068 4.3221 185.7776 5.8072 24.0795 3.6158 12.3683 25.1820 9.5724 27.9899 0.7769 13.5642 0.0535 3.8339 6.8134 8.4540 20.6660 2.2509 10.7990 5.3807 3.9698 58.8369 12.7778 12.2348 115.4900 57.9348 84.3441 5.3973 22.9798 35.2924 0.9274 32.7179 10.3462 47.3323 10.9102 16.8915 17.0078 20.9750 0.2449 43.6348 1.7535 10.6149 43.4809
temp: 298.150 k
press: 1.00000 atm
elementType: 8 7 6 6 6 6 6 6 6 6 6 6 6 6 6 6 6 1 1 1 1 1 1 1 1 1 1 1 1 1 1 1
symmnumber: 1
zpe: 678352.4 jmol-1
zpe.correction: 0.258371 hartree
zpe.thermalcorrener: 0.273724 hartree
zpe.thermalcorrenthalpy: 0.274668 hartree
zpe.thermalcorrgfe: 0.214784 hartree
zpe.sumelectzpe: -709.338521 hartree
zpe.sumelectthermal: -709.323168 hartree
zpe.sumelectthermalent: -709.322224 hartree
zpe.sumelectthermalfe: -709.382108 hartree
dipole: -4.2334 2.4244 -0.0556
dipole: 4.8788
quadrupole: -98.9671 -95.1357 -104.5690
quadrupole: 4.6259 2.0586 -4.1558
quadrupole: 0.5902 4.4216 -5.0118 4.6259 2.0586 -4.1558
hfenergy: -709.5968921 hartree
pointgroup: C01 [X(C15H15N1O1)]
dipole: -1.7244141 -0.3674872 -0.7587183 debye
polarizability: 297.0268295|2.2078333|116.8311062|-12.1239654|37.7452318|146.2289808 unknown
InChI: InChI=1S/C15H15NO/c1-2-13(14-6-8-16-9-7-14)10-12-4-3-5-15(17)11-12/h3-11,17H,2H2,1H3
charge 0 multiplicity 1
32 atoms
O  -4.796631 1.299991 1.93787
N  4.849284 0.277911 0.86404
C  0.678865 -0.036121 -0.44947
C  0.427274 -0.167644 -1.949596
C  2.102262 0.093087 -0.0049
C  -0.315459 0.003292 0.499271
C  -1.779299 -0.164754 0.343582
C  1.019779 1.013345 -2.764981
C  3.153099 -0.591171 -0.678623
C  2.488142 0.89275 1.108603
C  -2.632488 0.610784 1.173814
C  -2.371882 -1.114068 -0.541991
C  -4.033676 0.476224 1.090236
C  -3.773849 -1.248966 -0.607837
C  -4.619722 -0.452155 0.195793
C  4.480738 -0.47817 -0.213642
C  3.841711 0.9510 1.499918
H  -0.656824 -0.212867 -2.140152
H  0.851462 -1.119663 -2.330726
H  -0.002629 0.173546 1.540098
H  2.114461 1.088935 -2.646685
H  0.800072 0.884426 -3.840357
H  0.577317 1.971318 -2.438003
H  2.943387 -1.225283 -1.545996
H  1.747527 1.489613 1.650697
H  -2.217293 1.336351 1.88112
H  -1.736558 -1.780061 -1.132384
H  -4.216555 -1.990137 -1.282213
H  -5.710184 -0.562852 0.137474
H  5.293931 -1.011853 -0.719164
H  4.14789 1.566708 2.353555
H  -5.764051 1.134484 1.813847
