program: Gaussian 09
title: 000227574
version: EM64L-G09RevD.01
frameworkgroup: C1[X(C9H11ClN4)]
method: RPBEPBE
basis: SDD
operation: Freq
keyword: #p
keyword: freq=noraman
keyword: PBEPBE/SDD
title: #p freq=noraman PBEPBE/SDD
converged: YES YES NO NO
title: Mulliken charges:
elementType: Cl N N N N C C C C C C C C C H H H H H H H H H H H
charge: 0.020601 -0.149495 -0.033602 -0.006380 0.060508 -0.374599 -0.348758 -0.339428 0.131425 -0.212027 0.128326 -0.690140 -0.300585 -0.360523 0.245190 0.214269 0.232601 0.204625 0.203594 0.194866 0.272064 0.221820 0.212941 0.217482 0.255224
chargesum: 0.00000
title: Mulliken charges with hydrogens summed into heavy atoms:
elementType: Cl N N N N C C C C C C C C C
charge: 0.020601 -0.149495 -0.033602 -0.006380 0.060508 0.084860 0.088468 0.059033 0.131425 0.060037 0.128326 -0.037897 -0.300585 -0.105299
polarizability: 1.81619643e+02 4.54129065e+00 1.37034650e+02 1.49003490e+01 -4.10550377e+00 7.80476496e+01
1716.lowfreq: -6.3009 -0.0015 -0.0012 0.0014 3.7843 8.3023 28.2264 42.0959 62.4768
frequency: 27.4717 41.8527 62.3591 108.1304 115.0081 177.2464 192.6678 222.4557 235.8391 249.5285 278.9700 328.9490 378.9185 424.8455 527.5692 544.3711 560.3956 626.5706 643.6019 653.6870 732.1103 738.0337 789.8092 792.2130 805.3141 845.7504 896.9819 904.0040 915.0014 928.3290 1015.9640 1069.4787 1072.2430 1103.2873 1115.0586 1146.6934 1184.7472 1198.9292 1238.1021 1271.4012 1276.9111 1288.3234 1291.7627 1303.8201 1343.1093 1351.4452 1361.2914 1367.7573 1395.5194 1399.8802 1440.3487 1468.9969 1471.1285 1478.8620 1479.6360 1488.8810 1505.0688 1565.7304 2968.2322 2978.9121 2987.1902 3012.2295 3014.7520 3047.5975 3074.8295 3079.9276 3082.9949 3185.4103 3228.9039
redmass: 4.2057 5.8490 1.6318 2.4981 5.3652 5.7438 5.2856 2.0824 1.6806 3.3358 4.3889 4.8106 15.5384 3.2002 4.9360 5.1771 8.7133 7.0275 5.0314 6.8298 4.0849 1.1917 2.1724 2.0288 9.0881 1.5318 5.7290 1.7847 1.4344 1.2919 4.0001 2.4654 2.4452 5.5382 2.3526 4.4260 2.7100 1.8003 1.6859 1.3409 1.5342 6.3827 1.1079 3.8175 1.5115 1.7913 1.9094 2.3673 1.2123 1.9314 2.2578 1.2319 1.1883 1.0970 1.0687 1.0989 6.7720 9.6232 1.0592 1.0366 1.0605 1.0775 1.0806 1.1025 1.1016 1.0999 1.1051 1.0929 1.0986
irintensity: 0.2242 0.1160 0.0122 0.1656 0.5297 1.5287 0.7370 1.2386 0.4833 0.8481 0.2215 0.5978 7.6661 2.2628 7.3332 4.5359 9.9059 4.3195 16.8104 7.3468 18.5947 12.2153 2.8051 3.0184 26.5660 14.0422 68.4568 16.2628 12.8445 8.0957 2.6523 4.7680 2.3906 37.2524 12.8389 56.3307 0.3277 56.6387 32.6639 0.8172 2.2708 53.8754 0.6124 73.8895 12.8918 26.0310 13.9128 0.2561 10.5607 58.2409 63.6628 22.4951 25.9757 9.5695 14.6665 31.5338 104.7593 83.9701 29.1699 28.5077 23.7940 26.2070 23.5751 7.7236 28.7539 44.2088 57.3488 9.2470 0.1363
temp: 298.150 k
press: 1.00000 atm
elementType: 17 7 7 7 7 6 6 6 6 6 6 6 6 6 1 1 1 1 1 1 1 1 1 1 1
symmnumber: 1
zpe: 509031.0 jmol-1
zpe.correction: 0.193880 hartree
zpe.thermalcorrener: 0.206889 hartree
zpe.thermalcorrenthalpy: 0.207833 hartree
zpe.thermalcorrgfe: 0.152338 hartree
zpe.sumelectzpe: -1027.588717 hartree
zpe.sumelectthermal: -1027.575708 hartree
zpe.sumelectthermalent: -1027.574764 hartree
zpe.sumelectthermalfe: -1027.630258 hartree
dipole: -6.4049 -0.7894 -1.0689
dipole: 6.5413
quadrupole: -94.6482 -90.1834 -89.4419
quadrupole: 4.8659 -0.4917 1.7723
quadrupole: -3.2237 1.2411 1.9826 4.8659 -0.4917 1.7723
hfenergy: -1027.7825966 hartree
pointgroup: C01 [X(C9H11Cl1N4)]
dipole: -2.5129596 -0.162973 -0.5306657 debye
dipolederiv: -0.821972 0.2932971 -0.2074111 0.3734666 -0.2261302 0.1040228 -0.2282029 0.0886754 -0.1236681 -0.8195274 -0.0641155 -0.0707997 0.2066764 -0.4724861 0.0195413 -0.1381094 -0.0433316 -0.1868652 -0.6474736 -0.0293695 -0.0536853 -0.1481645 -0.3789757 -0.0286084 -0.1212015 -0.0099525 -0.246846 -0.6064262 -0.0029438 -0.1007952 -0.0875477 -0.4479187 0.0170459 -0.0964475 0.0165704 -0.1952224 -0.6194419 0.101811 -0.1164355 0.4091948 -0.9109892 0.1352725 -0.1497393 0.0485504 -0.1874163 0.6937517 0.0034974 0.0623926 -0.0801731 0.1790396 0.0022147 0.1375811 0.0360797 0.2673066 -0.0997249 0.026428 -0.0235221 0.0555806 0.1190903 -0.0270705 -0.0640833 -0.0539657 0.0015958 0.102749 0.0308588 0.0308994 0.0358348 0.1732955 -0.0085021 0.1408003 -0.0114498 0.0802548 0.723716 0.415526 0.1056941 0.1102719 0.2155333 -0.0234923 0.1538445 0.110842 0.1404418 0.5347697 -0.1864383 0.1327406 -0.4837969 0.3790033 -0.0779751 0.1892188 -0.0571223 -0.0060197 -0.7131226 0.050087 -0.1930221 0.4046648 0.1833802 0.0791268 -0.2438159 0.0186064 0.0275761 -0.0474277 0.0270188 0.0470694 0.034934 0.0774064 -0.0243627 -0.0042576 -0.0201865 0.0234098 1.5116889 -0.360996 0.3989468 -0.5920996 0.8484514 -0.1833475 0.4353646 -0.1241763 0.1665534 0.5999539 -0.1079175 0.1726796 -0.0719523 0.5748285 -0.0507317 0.191718 -0.0481544 -0.0073664 0.0162685 -0.00984 0.0144921 0.0508213 0.0047535 0.1147509 -0.0011949 0.0517048 0.0077351 -0.0188172 -0.0267479 -0.040771 -0.0603445 -0.05449 -0.1188042 -0.0261627 -0.0597832 0.0305465 0.0393145 -0.0548939 -0.0390174 -0.0700476 -0.0294787 -0.0865204 -0.0534139 -0.0572972 0.0127663 0.0510354 0.0255714 0.0083585 0.0229557 -0.0625014 0.120258 -0.000716 0.0901942 -0.0371465 0.0402632 -0.0161769 0.0358381 0.0145545 -0.0546374 0.136293 -0.0000737 0.1172067 -0.0677242 -0.0024883 -0.0366701 -0.033408 -0.0800861 -0.0906137 -0.1360745 -0.0563484 -0.1053578 -0.0169231 0.0518507 -0.070689 -0.0355829 -0.0489004 0.0745032 -0.0083042 -0.0371287 -0.0156996 0.1553226 -0.2085565 0.0706207 -0.0270564 0.0775974 0.0858138 0.0029713 -0.0447357 0.0113042 0.0608552 0.1002017 0.0201435 0.0004733 -0.0194271 -0.0683947 0.1424639 0.041353 0.0999203 -0.0404622 0.0589326 -0.1038493 -0.0531754 -0.0629969 -0.065594 -0.1101711 -0.0082345 -0.0888307 0.01132 0.0804827 0.0057881 -0.0149022 0.0089839 -0.0528893 0.0100035 -0.0160143 0.005653 0.1299762 unknown
polarizability: 180.6771696|1.2583828|137.1023111|18.7188155|0.5611966|78.9224617 unknown
InChI: InChI=1S/C9H11ClN4/c1-2-3-4-14-6-13-7-8(10)11-5-12-9(7)14/h5-6H,2-4H2,1H3
charge 0 multiplicity 1
25 atoms
Cl 4.286358 -0.646788 0.809428
N  -0.572672 -0.753365 -0.593277
N  1.297815 -1.976004 -0.018532
N  0.358796 1.530515 -0.377979
N  2.709496 1.50528 0.298725
C  -1.970685 -0.435041 -0.949578
C  -2.833659 -0.082494 0.282822
C  -4.287818 0.258045 -0.114706
C  0.430367 0.175365 -0.320759
C  0.004564 -2.016146 -0.390616
C  1.590871 -0.604236 0.032115
C  -5.157576 0.62421 1.10733
C  2.735251 0.163477 0.341386
C  1.538028 2.132826 -0.055947
H  -1.949803 0.419019 -1.650118
H  -2.39009 -1.30706 -1.484076
H  -2.378142 0.781375 0.80309
H  -2.828411 -0.93218 0.993831
H  -4.28324 1.103459 -0.831986
H  -4.740208 -0.603984 -0.646432
H  -0.564368 -2.933033 -0.535117
H  -6.192133 0.86727 0.805073
H  -5.2035 -0.213234 1.828259
H  -4.744723 1.502404 1.637351
H  1.563482 3.224819 -0.079286
