program: Gaussian 09
title: 000227571
version: EM64L-G09RevD.01
frameworkgroup: C1[X(C8H13ClN4)]
method: RPBEPBE
basis: SDD
operation: Freq
keyword: #p
keyword: freq=noraman
keyword: PBEPBE/SDD
title: #p freq=noraman PBEPBE/SDD
converged: YES YES NO NO
title: Mulliken charges:
elementType: Cl N N N N C C C C C C C C H H H H H H H H H H H H H
charge: -0.058231 -0.391715 -0.056236 -0.653865 0.046366 -0.385562 -0.348173 -0.342850 -0.681610 0.190875 0.266490 -0.276518 -0.375590 0.205342 0.198358 0.219611 0.249065 0.208370 0.173822 0.301165 0.211168 0.220748 0.212827 0.302331 0.317098 0.246713
chargesum: 0.00000
title: Mulliken charges with hydrogens summed into heavy atoms:
elementType: Cl N N N N C C C C C C C C
charge: -0.058231 -0.090551 -0.056236 -0.034435 0.046366 0.018137 0.120503 0.039343 -0.036867 0.190875 0.266490 -0.276518 -0.128877
polarizability: 1.81206866e+02 -1.86418945e+00 1.36625027e+02 5.11382375e+00 3.31873415e+00 7.08111747e+01
1716.lowfreq: -0.0024 -0.0020 0.0005 2.9707 7.4938 11.8606 23.0697 54.7077 68.3327
frequency: 22.5527 54.6915 68.2505 88.2729 126.3229 170.1910 212.5277 226.0690 235.1675 249.4422 254.8991 305.1866 326.8800 344.4579 358.0272 458.4662 503.3457 543.9969 559.7604 585.9730 593.6757 612.4144 690.3493 734.0859 758.1445 784.0490 814.9807 842.5817 895.3944 898.9267 947.2766 987.0479 1046.2076 1077.9404 1106.2872 1114.0793 1134.6940 1163.3239 1199.1115 1224.2374 1259.0957 1291.2126 1299.3120 1307.4303 1328.1569 1346.4026 1361.5387 1391.8386 1393.1044 1432.4032 1457.6593 1458.1955 1471.7956 1478.2961 1485.2628 1487.7461 1542.4839 1562.8874 1631.1718 2954.9072 2957.5140 2975.8384 2980.2442 3005.9490 3043.0612 3063.1390 3072.2178 3077.8680 3178.5177 3494.3864 3524.2589 3628.9949
redmass: 4.1520 4.4908 2.2444 2.6324 3.6302 4.3047 6.0312 1.5352 4.5425 2.0979 2.0749 3.7541 3.1449 1.2005 10.8816 3.2269 4.4648 3.1800 1.5415 3.8216 1.9586 2.3142 4.9412 1.1838 9.3099 5.0609 1.8670 2.0255 1.9302 1.5747 1.3304 2.0600 2.9855 2.0604 2.3801 2.8266 1.8965 3.5007 2.5510 1.3089 1.3062 1.2147 2.0063 1.8624 2.5889 1.5184 1.5314 1.2127 1.7785 2.0657 1.0835 4.1763 1.0714 1.0430 1.0736 1.0770 4.6427 4.8293 1.2583 1.0625 1.0699 1.0371 1.0596 1.0961 1.1019 1.0930 1.1006 1.0996 1.0924 1.0451 1.0757 1.1014
irintensity: 1.8376 0.2464 0.4706 0.2356 1.1780 0.9640 0.2926 1.6944 1.1973 3.8016 0.2558 10.2187 8.8132 44.1969 11.9689 1.2976 6.7937 23.8356 119.4491 24.0966 128.2881 134.3770 27.0997 16.4705 5.3040 16.3077 7.9075 2.6685 9.9399 20.9135 6.9578 10.5944 3.7135 130.0300 10.8207 11.1791 2.7289 11.4680 7.7437 16.3317 15.1118 1.1510 6.0507 16.6546 48.2476 32.0597 2.1474 10.0101 57.6491 2.8128 6.7073 108.2278 2.9290 14.3982 26.8919 27.5165 627.8675 45.2938 116.8959 56.2179 31.3488 25.7295 55.4347 7.2376 44.1019 17.0919 78.9278 43.4692 13.9486 28.2271 38.5223 31.9156
temp: 298.150 k
press: 1.00000 atm
elementType: 17 7 7 7 7 6 6 6 6 6 6 6 6 1 1 1 1 1 1 1 1 1 1 1 1 1
symmnumber: 1
zpe: 551850.4 jmol-1
zpe.correction: 0.210189 hartree
zpe.thermalcorrener: 0.224032 hartree
zpe.thermalcorrenthalpy: 0.224976 hartree
zpe.thermalcorrgfe: 0.168292 hartree
zpe.sumelectzpe: -990.724907 hartree
zpe.sumelectthermal: -990.711064 hartree
zpe.sumelectthermalent: -990.710120 hartree
zpe.sumelectthermalfe: -990.766804 hartree
dipole: -5.4507 -2.8527 -0.9252
dipole: 6.2213
quadrupole: -93.9515 -80.9722 -86.1332
quadrupole: -2.4469 -1.5772 2.2848
quadrupole: -6.9326 6.0468 0.8858 -2.4469 -1.5772 2.2848
hfenergy: -990.9350958 hartree
pointgroup: C01[X(C8H13Cl1N4)]
dipole: -2.2172895 1.0130462 0.2198053 debye
dipolederiv: -0.6037264 -0.4022158 0.0224888 -0.4900776 -0.5737828 0.0170196 0.0274059 0.0299718 -0.1003639 -1.7416103 -0.0770403 0.0160956 0.2597983 -0.2910389 -0.1402287 0.3362317 -0.0966017 -0.4012313 -0.7540997 -0.1392743 0.0009238 0.3581955 -0.3634796 0.008392 -0.0570058 -0.0042999 -0.1997183 -0.3519357 0.4049536 -0.1879785 0.2736585 -1.1207121 -0.0008716 -0.1984116 0.1611108 -0.4924751 -0.6358668 0.0051458 0.019533 0.0088324 -0.8959589 0.0037427 0.068323 0.0321783 -0.1401018 0.0247 0.0347935 0.0038526 -0.0063398 0.0947378 0.0325249 -0.0018243 0.0061713 0.1142483 0.5976889 0.1771348 0.0158339 0.4335822 0.3154387 0.0801899 -0.1078488 0.0761763 0.2793097 0.050028 0.0356027 0.0242942 0.1323455 0.110942 0.04075 0.0558917 0.0444065 0.0976296 -0.0322885 0.0497734 0.0039727 0.0394688 0.0642584 0.0118335 -0.0361305 0.0150014 0.0726812 1.9112078 -0.1637817 -0.0143117 -0.101854 0.0789586 0.0133848 -0.0011083 0.0693194 0.1420418 -0.821717 -0.5349754 0.0758158 -0.7302194 0.7893763 0.0661589 0.0643191 0.0984006 0.0865343 1.1644115 0.7195519 -0.0607646 0.4266464 1.0042804 -0.0241439 -0.0948091 -0.1413073 -0.0194874 0.5737051 0.17355 -0.0275742 -0.0974884 0.5362828 -0.0211676 -0.0493734 -0.0321501 -0.0806106 0.0844911 0.0159888 -0.0123521 0.065679 0.0035962 -0.1125307 0.0018513 -0.0642134 -0.1342448 -0.1045835 -0.1177896 0.0191723 -0.1147416 -0.0682335 0.0382625 -0.0209335 0.0139659 0.0738107 -0.0676687 -0.0153175 0.0076991 -0.1555485 -0.0104402 -0.0756399 -0.0383384 -0.1272357 -0.112897 0.0063729 0.0569946 -0.0516031 -0.0262198 -0.0078805 0.069784 -0.0268141 0.0849552 -0.0082701 0.0485946 0.0363398 0.0275118 0.0229112 0.0067566 -0.1149702 0.0202963 -0.0729677 -0.1365467 -0.1146745 -0.1314133 0.0139084 -0.1860755 -0.0990498 0.0390922 0.0070943 0.0148128 0.0535122 0.3012338 -0.0274405 0.0079184 -0.1085253 0.0981836 0.0561845 -0.1286039 0.0680374 0.2514192 0.0648197 -0.0001511 -0.0100006 0.0195183 0.0354698 -0.1026699 0.0564012 -0.1259496 -0.1184363 0.0035715 0.0654103 -0.0517122 0.1087625 -0.0178941 0.1192378 -0.0951384 0.1298511 -0.0395213 -0.0475732 -0.0836598 0.0101973 -0.157695 -0.0777716 0.0028831 0.0288027 0.0005317 0.0955949 0.2076953 -0.0613192 0.1023851 -0.0209955 0.2137851 0.0150874 0.1580529 -0.1181943 0.2552982 0.1822558 -0.0569021 0.0417781 -0.0020529 0.2428183 -0.0261091 0.0164015 -0.0642782 0.3240321 0.0549682 0.0360411 0.0029162 0.0484351 -0.0686425 0.0038038 0.0152682 0.0023074 0.1377924 unknown
polarizability: 181.0849034|4.2098694|137.122273|-1.5436128|-1.0352166|70.4358915 unknown
InChI: InChI=1S/C8H13ClN4/c1-2-3-4-11-8-6(10)7(9)12-5-13-8/h5,11H,2-4,10H2,1H3
charge 0 multiplicity 1
26 atoms
Cl 4.055527 1.650771 -0.010276
N  -0.893586 -0.020798 0.19291
N  0.847015 -1.633952 0.170643
N  0.994592 2.091751 0.242762
N  3.164986 -0.940354 0.042697
C  -3.327895 -0.484806 0.437007
C  -1.928209 -1.074113 0.17454
C  -3.835138 0.483241 -0.660318
C  -5.28226 0.956508 -0.403434
C  0.456314 -0.323446 0.17618
C  1.418639 0.759547 0.18427
C  2.758338 0.339032 0.080575
C  2.185498 -1.882879 0.120834
H  -3.335379 0.027003 1.420418
H  -4.039183 -1.330507 0.515052
H  -1.912908 -1.612844 -0.796978
H  -1.662681 -1.81748 0.945426
H  -3.775586 -0.022201 -1.645254
H  -3.177639 1.375973 -0.728366
H  -1.160268 0.900471 -0.162972
H  -5.361972 1.483648 0.565866
H  -5.629123 1.646244 -1.193971
H  -5.977705 0.096869 -0.375001
H  0.193377 2.317673 0.833729
H  1.719815 2.807147 0.170228
H  2.501129 -2.928798 0.129734
