program: Gaussian 09
title: 000227516
version: EM64L-G09RevD.01
frameworkgroup: C1[X(C12H9ClN6O2)]
method: RPBEPBE
basis: SDD
operation: Freq
keyword: #p
keyword: freq=noraman
keyword: PBEPBE/SDD
title: #p freq=noraman PBEPBE/SDD
converged: YES YES NO NO
title: Mulliken charges:
elementType: Cl O O N N N N N N C C C C C C C C C C C C H H H H H H H H H
charge: 0.010090 -0.216508 -0.210614 -0.171739 -0.441529 0.001984 0.057953 -0.038354 0.020714 -0.017319 0.175919 0.255720 -0.410282 0.478656 -0.606860 -0.437946 -0.291247 -0.338069 0.395697 -0.348758 -0.371244 0.325137 0.262748 0.253124 0.253095 0.265231 0.231239 0.334841 0.289087 0.289232
chargesum: 0.00000
title: Mulliken charges with hydrogens summed into heavy atoms:
elementType: Cl O O N N N N N N C C C C C C C C C C C C
charge: 0.010090 -0.216508 -0.210614 -0.171739 -0.116392 0.001984 0.057953 -0.038354 0.020714 -0.017319 0.175919 0.255720 -0.147535 0.478656 0.164591 -0.206706 0.043594 -0.338069 0.395697 -0.059670 -0.082012
polarizability: 3.92344586e+02 -1.36797189e+01 2.21196286e+02 2.97620459e-02 1.19676638e-01 7.44100831e+01
1716.lowfreq: -3.6124 -0.0020 -0.0013 0.0005 2.5221 6.0073 28.5125 37.1200 58.5515
frequency: 28.3836 37.1123 58.5494 76.1131 81.0719 98.5014 111.6671 156.6964 157.7081 166.0159 212.0334 213.2748 259.2721 279.8258 310.6784 341.4809 349.9432 368.0532 410.8601 418.7747 501.0823 502.0389 519.0554 542.8148 616.3978 617.4898 622.9706 633.3459 659.9349 668.4179 674.6080 689.6501 740.2547 749.3814 766.1078 782.9224 787.2380 822.3150 831.1162 835.8320 884.0232 901.8916 958.0683 979.2767 999.8904 1019.4065 1026.9486 1096.4501 1114.5848 1123.8506 1130.0087 1179.9578 1187.5271 1219.7915 1222.9818 1231.3864 1268.6254 1299.8909 1304.8129 1351.3554 1360.2381 1370.2993 1395.8861 1416.9578 1425.6475 1434.3157 1461.1816 1468.2748 1486.1905 1492.4789 1515.7765 1540.2931 1579.3842 1607.6748 1616.9795 3010.8177 3106.4350 3125.1946 3130.7359 3179.3530 3186.3464 3198.5069 3213.2208 3533.4527
redmass: 6.6609 6.7956 10.5777 5.8311 4.7826 1.2079 5.3266 4.3998 7.9149 7.8753 5.7022 6.9133 6.4067 5.5752 5.1115 5.7506 7.8607 15.8464 8.9768 3.0201 2.9103 8.6258 5.7954 6.5392 4.5223 7.4408 1.9981 7.6525 8.2540 5.1499 3.1368 8.2913 4.4332 8.6704 9.1855 3.0083 8.0942 1.8405 6.3370 1.4093 1.4700 9.3545 2.8484 1.3463 3.2142 1.3139 4.7082 2.9450 1.8686 2.0175 1.3128 1.4546 2.1949 2.4388 4.2223 4.0921 3.2789 1.6273 4.3249 5.3273 11.6712 5.0149 6.1814 3.3961 1.7815 3.9732 1.8781 1.0420 1.8157 1.8588 3.7924 5.7024 5.8360 3.6966 5.2646 1.0330 1.1029 1.0907 1.1021 1.0906 1.0945 1.0966 1.0975 1.0758
irintensity: 0.5788 0.2558 0.5714 0.4249 2.5714 0.0607 0.6653 1.3820 3.6363 0.5117 2.9839 0.0054 11.5237 3.6891 0.5214 1.2306 0.0165 6.5298 3.3109 0.0490 21.5292 0.4030 4.5512 13.7521 8.1720 8.9218 18.2365 3.1359 4.7098 27.3293 12.3356 17.1741 5.2399 28.6677 26.4321 30.7344 15.5820 5.1316 3.1539 41.1167 64.4388 70.0613 34.4616 0.8856 0.0097 0.2563 51.8216 35.3102 102.6285 20.7069 0.9768 261.4194 115.1285 13.3152 577.5969 17.0157 61.7365 47.4780 112.5993 42.6680 104.9890 85.3994 23.0759 175.2549 33.0355 23.2047 90.8752 18.1701 3.0291 276.5530 164.0571 528.7854 506.3749 386.7066 12.8638 41.8154 13.5980 11.7238 2.7374 4.5150 3.4534 10.8725 1.6203 22.6420
temp: 298.150 k
press: 1.00000 atm
elementType: 17 8 8 7 7 7 7 7 7 6 6 6 6 6 6 6 6 6 6 6 6 1 1 1 1 1 1 1 1 1
symmnumber: 1
zpe: 544632.0 jmol-1
zpe.correction: 0.207439 hartree
zpe.thermalcorrener: 0.224984 hartree
zpe.thermalcorrenthalpy: 0.225928 hartree
zpe.thermalcorrgfe: 0.159983 hartree
zpe.sumelectzpe: -1400.138430 hartree
zpe.sumelectthermal: -1400.120886 hartree
zpe.sumelectthermalent: -1400.119941 hartree
zpe.sumelectthermalfe: -1400.185887 hartree
dipole: 6.2791 -4.7146 -0.0009
dipole: 7.8521
quadrupole: -161.4748 -126.5848 -128.4723
quadrupole: 3.6516 0.0474 0.0318
quadrupole: -22.6308 12.2591 10.3717 3.6516 0.0474 0.0318
hfenergy: -1400.3458695 hartree
pointgroup: C01 [X(C12H9Cl1N6O2)]
dipole: 2.5359941 -1.7570133 0.1584129 debye
polarizability: 393.1042481|-7.5479832|219.0961586|-0.7299481|-13.8924369|75.7505486 unknown
InChI: InChI=1S/C12H9ClN6O2/c1-18-11-9(6-14-18)10(16-12(13)17-11)15-7-2-4-8(5-3-7)19(20)21/h2-6,15H,1H3
charge 0 multiplicity 1
30 atoms
Cl 1.969604 3.69217 -0.409076
O  -6.368892 -0.888192 0.075976
O  -5.972279 1.350817 -0.134927
N  4.714949 -0.638432 0.003855
N  0.022603 -0.960545 0.052245
N  4.415802 -2.000021 0.137623
N  3.485444 1.483211 -0.198892
N  1.061341 1.18138 -0.160527
N  -5.57159 0.126652 -0.022921
C  2.459798 -0.782895 0.025559
C  3.567985 0.123304 -0.066345
C  1.161636 -0.1733 -0.029002
C  3.055541 -2.081183 0.149727
C  -1.350037 -0.617421 0.026157
C  6.102478 -0.177394 -0.045291
C  -2.276089 -1.697497 0.132427
C  -1.833531 0.716472 -0.096828
C  2.210781 1.903758 -0.235624
C  -4.118325 -0.130374 -0.0061
C  -3.657052 -1.460977 0.116934
C  -3.218573 0.953043 -0.112253
H  0.209496 -1.961493 0.147488
H  2.596926 -3.06417 0.247142
H  6.628717 -0.458706 0.881422
H  6.621643 -0.626908 -0.907466
H  6.089957 0.918612 -0.148305
H  -1.907908 -2.72667 0.227532
H  -1.11874 1.535658 -0.177058
H  -4.38097 -2.275468 0.197229
H  -3.613413 1.968073 -0.205501
