program: Gaussian 09
title: 000227472
version: EM64L-G09RevD.01
frameworkgroup: C1[X(C7H8ClN5)]
method: RPBEPBE
basis: SDD
operation: Freq
keyword: #p
keyword: freq=noraman
keyword: PBEPBE/SDD
title: #p freq=noraman PBEPBE/SDD
converged: YES YES NO NO
title: Mulliken charges:
elementType: Cl N N N N N C C C C C C C H H H H H H H H
charge: -0.022025 -0.131516 -0.438176 -0.025898 0.086979 0.004857 0.153248 0.291250 0.031072 -0.658022 -0.646785 -0.380723 -0.389721 0.345626 0.238324 0.253386 0.238225 0.230940 0.308083 0.230882 0.279993
chargesum: 0.00000
title: Mulliken charges with hydrogens summed into heavy atoms:
elementType: Cl N N N N N C C C C C C C
charge: -0.022025 -0.131516 -0.092550 -0.025898 0.086979 0.004857 0.153248 0.291250 0.031072 0.071914 0.123120 -0.100730 -0.389721
polarizability: 1.57879032e+02 -1.79637747e+00 1.54067157e+02 -1.02105174e-01 2.57587664e-02 5.59863224e+01
1716.lowfreq: -3.9088 0.0016 0.0020 0.0026 10.2797 10.6942 59.5818 91.5286 107.4900
frequency: 59.5523 91.5281 107.4850 155.6640 170.7724 178.0810 220.8761 239.6000 263.8964 341.1257 360.6144 363.4576 374.6313 504.2059 534.2909 535.7942 619.1676 647.4720 653.2047 664.1714 722.8948 777.0071 839.9720 843.8989 898.6906 927.3058 1046.2305 1059.9335 1066.8043 1095.5088 1134.4036 1136.7544 1200.3511 1209.6848 1262.0188 1281.6229 1334.7335 1359.8900 1380.6940 1399.0786 1414.4799 1433.2045 1459.0785 1483.8774 1487.2075 1497.3131 1499.6130 1535.6744 1586.7770 2954.3567 2973.5244 3030.5499 3051.7382 3109.1944 3126.6306 3247.3461 3638.3600
redmass: 2.4810 5.1779 2.7008 1.4617 4.6450 1.2298 7.4618 6.3396 2.6728 4.4237 9.4660 6.0460 4.4308 5.4626 1.7827 4.7311 3.7481 7.8152 8.7836 3.4625 10.9648 4.6946 7.9346 1.5284 6.3073 3.5760 4.9544 1.5652 2.3873 1.2183 7.0950 1.3550 1.6670 3.4098 3.4641 4.6658 5.0297 6.6739 3.7652 4.9732 1.2291 1.3091 1.3431 1.0503 1.7700 1.0454 1.0767 7.0117 5.3818 1.0378 1.0361 1.1025 1.1023 1.0949 1.0974 1.0988 1.0821
irintensity: 0.0040 0.1217 2.5504 0.0466 0.7967 2.0905 0.8378 0.0148 4.4267 8.1268 1.7658 3.7243 3.4091 1.0640 55.3186 2.9327 5.7766 5.9946 0.3720 41.0927 30.1997 0.0350 33.4793 34.7131 45.5896 58.3139 11.8048 48.1166 57.6484 0.0508 126.3064 1.5856 4.9530 15.5602 0.6804 129.7132 56.0760 51.6683 17.1761 132.4173 30.6510 78.6205 13.7129 27.9983 6.9154 3.3246 2.4025 200.3121 482.2884 44.9257 83.2465 30.6260 32.4999 13.1241 0.3875 0.0365 65.0481
temp: 298.150 k
press: 1.00000 atm
elementType: 17 7 7 7 7 7 6 6 6 6 6 6 6 1 1 1 1 1 1 1 1
symmnumber: 1
zpe: 404289.9 jmol-1
zpe.correction: 0.153986 hartree
zpe.thermalcorrener: 0.165731 hartree
zpe.thermalcorrenthalpy: 0.166675 hartree
zpe.thermalcorrgfe: 0.115667 hartree
zpe.sumelectzpe: -1004.389710 hartree
zpe.sumelectthermal: -1004.377965 hartree
zpe.sumelectthermalent: -1004.377021 hartree
zpe.sumelectthermalfe: -1004.428029 hartree
dipole: -6.6797 3.9768 0.0033
dipole: 7.7739
quadrupole: -82.3020 -79.9783 -83.6903
quadrupole: -9.4090 0.0357 0.0149
quadrupole: -0.3118 2.0119 -1.7001 -9.4090 0.0357 0.0149
hfenergy: -1004.5436962 hartree
pointgroup: C01 [X(C7H8Cl1N5)]
dipole: -2.712201 1.3627515 0.3757803 debye
dipolederiv: -0.2195825 0.2418815 0.0461135 0.2951025 -0.8778842 -0.1429551 0.054501 -0.1402602 -0.1150314 -1.5427404 0.1100005 0.0880984 0.0045541 -0.4471865 -0.0191321 0.0808493 -0.0301301 -0.3285399 -0.4884498 0.2144184 0.0510832 0.0241022 -0.3519674 -0.0275117 0.0228136 -0.0377681 -0.1999579 -1.2389989 0.3409482 0.1158019 0.5577824 -0.7792039 -0.1273891 0.1533227 -0.1139903 -0.2146872 -0.6286113 -0.2827762 -0.0179079 0.2513345 -1.0406925 -0.1555022 0.0671852 -0.1256537 -0.1790005 0.3641882 -0.1020972 -0.0487531 -0.1685999 -0.4074811 -0.0232869 -0.0596304 -0.0266109 -0.1998613 -0.6956272 -0.2408468 0.0040041 -0.4536023 0.1194932 0.0414469 -0.0322881 0.0275975 0.0298177 2.0657737 -0.1024618 -0.1251843 -0.1143597 0.4309246 0.0375946 -0.1288267 0.0373166 0.2388074 0.2156756 0.0973435 0.0055946 -0.3135003 0.5658297 0.1002755 -0.059749 0.0770276 0.0647008 0.2315812 -0.1284159 -0.017479 -0.3723977 0.3614382 0.0346528 -0.0597327 0.0214285 0.263235 0.2398133 0.208539 0.0362528 0.4736549 0.189059 -0.0363537 0.0752402 -0.020896 0.2346745 0.1817424 0.0582587 -0.008564 0.4012834 -0.0653365 -0.0138867 0.0454201 0.0061148 -0.1277507 1.1960684 -0.2547523 -0.1095338 -0.5189581 1.823343 0.3210906 -0.1522659 0.3065012 0.0597709 0.1956912 -0.0128677 0.0039087 -0.019165 0.2332291 -0.0102304 0.002308 -0.010729 0.3035933 0.0780869 -0.0472048 -0.0955004 0.0843041 -0.0364945 -0.0774684 -0.0198995 -0.0909477 -0.082228 -0.113361 0.0042519 0.0189697 -0.0765256 0.0975726 0.0030564 0.006769 -0.0034953 0.1225305 0.08812 -0.0535191 0.0552072 0.0946371 -0.0940788 0.0672381 0.0227729 0.1017075 -0.0446746 -0.0607818 -0.0807995 0.0842765 -0.0974586 0.0806205 -0.0082051 0.1422226 0.0426456 -0.0852178 0.196165 0.1033129 0.0141006 0.0151167 0.0315418 -0.0182538 -0.0004088 -0.0225665 0.127282 -0.0899779 -0.0501105 -0.1059785 -0.0427881 0.0716172 0.0671509 -0.1659545 0.015132 -0.0477957 0.0252249 -0.0231028 0.0054897 -0.0245164 0.0956566 -0.0123305 0.005351 -0.0124232 0.1803329 unknown
polarizability: 156.4143275|-1.5654374|152.7119001|-6.061371|15.4999194|58.8062833 unknown
InChI: InChI=1S/C7H8ClN5/c1-13(2)6-5-4(3-9-12-5)10-7(8)11-6/h3,12H,1-2H3
charge 0 multiplicity 1
21 atoms
Cl 1.569682 -3.355409 -0.715086
N  -2.236403 -0.151818 0.020889
N  -0.007063 2.203402 0.261765
N  -0.334788 -1.508062 -0.309593
N  1.973767 -0.722317 -0.316868
N  1.246994 2.807403 0.283589
C  0.064176 0.83012 0.041751
C  -0.864032 -0.266034 -0.079154
C  1.467049 0.542079 -0.085829
C  -2.884237 1.143236 0.276911
C  -3.10404 -1.335861 -0.131383
C  2.136817 1.799785 0.073454
C  1.010844 -1.645808 -0.409385
H  -0.820073 2.795708 0.400619
H  -2.560411 1.5809 1.241697
H  -3.971992 0.987011 0.338482
H  -2.701598 1.866316 -0.542814
H  -3.695259 -1.502983 0.788664
H  -2.464348 -2.210335 -0.316495
H  -3.796184 -1.200874 -0.983908
H  3.203297 2.007941 0.044196
