program: Gaussian 09
title: 000227435
version: EM64L-G09RevD.01
frameworkgroup: C1[X(C17H18O3)]
method: RPBEPBE
basis: SDD
operation: Freq
keyword: #pfreq=noraman
keyword: PBEPBE/SDD
title: #p freq=noraman PBEPBE/SDD
converged: YES YES NO NO
title: Mulliken charges:
elementType: O O O C C C C C C C C C C C C C C C C C H H H H H H H H H H H H H H H H H H
charge: -0.291746 -0.267621 -0.253694 -0.712101 0.429636 0.517094 0.045458 -0.365894 -0.455642 -0.366715 -0.341704 -0.230241 -0.244205 -0.350125 -0.352325 0.137947 0.310221 -0.221884 -0.669095 -0.538152 0.255184 0.218518 0.240554 0.230025 0.241418 0.270265 0.230144 0.234433 0.247550 0.237589 0.231203 0.230189 0.212921 0.229048 0.228959 0.220199 0.218806 0.243782
chargesum: 0.00000
title: Mulliken charges with hydrogens summed into heavy atoms:
elementType: O O O C C C C C C C C C C C C C C C C C
charge: -0.291746 -0.267621 -0.253694 -0.238400 0.429636 0.517094 0.045458 -0.125339 -0.225617 -0.125298 -0.071439 -0.000097 -0.009772 -0.102575 -0.114736 0.137947 0.310221 0.239509 0.001833 0.144635
polarizability: 2.42860398e+02 -3.83193696e+00 1.96296395e+02 -1.24615850e+01 -6.31424606e+00 1.47814676e+02
1716.lowfreq: -7.5537 -0.0004 0.0005 0.0007 2.6265 7.2773 19.5090 22.8944 25.6548
frequency: 19.0805 22.7246 25.6324 47.1678 66.7044 85.5974 94.8303 102.6495 140.9801 151.3882 183.2627 217.6416 232.3455 258.6485 260.6868 296.5652 303.7732 338.0716 369.7439 383.1508 413.7747 421.7038 426.3042 478.7556 510.1373 518.9232 531.0797 603.0516 631.5076 650.0447 684.1055 700.5820 729.8535 762.0883 785.5187 787.5782 798.8292 805.2124 819.0762 827.1542 839.6578 848.0273 895.7829 922.8842 951.7424 961.6483 975.2290 990.1524 1000.0455 1004.2074 1015.8514 1033.7744 1062.6655 1093.1481 1110.7684 1112.8562 1114.4975 1133.7324 1155.4947 1174.0638 1178.0751 1188.5959 1192.8591 1213.0296 1229.2147 1233.9849 1246.0269 1284.6622 1303.8334 1317.1511 1352.4809 1378.3772 1384.7177 1400.8179 1416.5325 1432.0818 1436.6560 1463.9299 1466.4068 1466.5439 1472.8288 1473.8150 1475.9668 1486.0926 1500.4837 1571.7231 1584.7383 1599.6685 1614.1602 1622.7041 2956.6465 2995.3401 2997.5973 3011.2907 3042.9099 3069.4304 3083.5821 3091.7993 3106.6079 3118.5766 3122.1069 3123.0346 3135.6124 3138.6785 3152.3353 3158.4994 3164.0338 3168.7929
redmass: 3.8468 4.6047 4.0321 4.1461 3.5319 3.6005 2.7614 3.7253 3.6184 3.7000 4.8017 2.4194 1.2116 1.5969 3.5627 4.8155 4.4822 4.6684 3.1113 2.7930 2.9409 4.4738 3.5185 3.9600 2.8752 4.1598 4.4572 4.2947 6.7138 6.1053 4.9137 3.6207 2.9916 3.8929 2.6433 2.1636 1.1380 2.4297 1.3968 3.8203 2.2050 3.8402 1.5112 1.6980 1.5268 1.3635 1.3940 8.7717 1.3446 2.7103 2.4753 3.9287 2.8398 1.9883 1.7229 1.2608 1.7463 1.4614 1.3527 1.0993 1.2268 1.1597 2.4771 1.9948 3.9067 3.4880 1.1383 1.5573 1.3176 1.4276 1.4221 5.5812 5.5171 1.2623 3.1738 2.2321 1.1775 1.0419 1.1015 1.0501 1.1060 1.1369 1.9579 1.0928 2.3687 6.9666 7.0214 8.8094 6.9421 6.4075 1.0331 1.0359 1.0671 1.0582 1.1038 1.1064 1.0928 1.0986 1.1026 1.0895 1.0990 1.0866 1.0879 1.0897 1.0940 1.0949 1.0952 1.1000
irintensity: 0.9668 1.4487 0.1095 0.2765 1.1428 2.3419 0.9458 4.1515 4.1814 1.1974 0.6657 1.3912 0.0097 1.4127 3.5797 6.7759 0.9541 1.5162 10.6805 3.8754 0.1758 1.2821 0.7238 1.0308 13.7220 3.1324 18.0654 10.1972 0.8588 2.2852 20.3424 11.7802 15.5451 30.3685 17.1479 19.3759 5.9614 26.4670 0.7488 3.4900 45.9389 2.8129 0.9708 5.3890 3.3080 0.0487 2.8640 40.2017 1.4186 10.5010 6.4618 197.2423 52.1772 69.5383 21.0134 0.1888 10.9534 5.3992 0.5941 3.4979 57.2260 8.9155 1.8357 29.7099 127.1729 287.3136 0.1263 14.1783 0.7641 0.9229 0.5504 6.8124 11.6418 15.9522 0.2652 18.6811 11.4265 10.2948 23.2593 12.7650 56.8055 9.1625 11.3729 14.3533 138.7345 18.0615 1.3986 201.0322 63.7389 53.3143 66.5816 18.0488 25.5450 22.3191 50.1463 5.6728 3.8784 38.0488 39.5509 16.9857 29.9902 3.7101 6.9430 11.4671 12.8212 15.0329 6.1757 24.2364
temp: 298.150 k
press: 1.00000 atm
elementType: 8 8 8 6 6 6 6 6 6 6 6 6 6 6 6 6 6 6 6 6 1 1 1 1 1 1 1 1 1 1 1 1 1 1 1 1 1 1
symmnumber: 1
zpe: 804531.6 jmol-1
zpe.correction: 0.306430 hartree
zpe.thermalcorrener: 0.325632 hartree
zpe.thermalcorrenthalpy: 0.326576 hartree
zpe.thermalcorrgfe: 0.255997 hartree
zpe.sumelectzpe: -882.822663 hartree
zpe.sumelectthermal: -882.803461 hartree
zpe.sumelectthermalent: -882.802517 hartree
zpe.sumelectthermalfe: -882.873096 hartree
dipole: -1.7932 0.7325 -1.0494
dipole: 2.2031
quadrupole: -127.8800 -102.8699 -109.7355
quadrupole: -7.0371 6.9379 -1.8444
quadrupole: -14.3848 10.6252 3.7596 -7.0371 6.9379 -1.8444
hfenergy: -883.129093 hartree
pointgroup: C01 [X(C17H18O3)]
dipole: -0.6823787 -0.3799215 0.375863 debye
polarizability: 242.1321296|5.6928158|197.6658647|13.3733788|-0.0720912|147.173475 unknown
InChI: InChI=1S/C17H18O3/c1-3-20-17(18)16-7-5-4-6-14(16)12-13-8-10-15(19-2)11-9-13/h4-11H,3,12H2,1-2H3
charge 0 multiplicity 1
38 atoms
O  1.895702 -1.784296 -0.13158
O  -5.038259 -0.375704 0.493298
O  4.101011 -1.275126 0.386194
C  0.403246 0.432393 -1.293691
C  1.319965 1.125585 -0.281208
C  -1.023576 0.212405 -0.78608
C  2.463894 0.533995 0.340303
C  1.035876 2.485295 0.01854
C  -2.137231 0.730541 -1.49817
C  -1.27635 -0.527155 0.394846
C  3.29158 1.319128 1.196135
C  1.842167 3.247998 0.885209
C  2.988022 2.662275 1.474606
C  -3.45653 0.518986 -1.052723
C  -2.591951 -0.749223 0.859576
C  2.92157 -0.885968 0.188471
C  -3.688045 -0.222298 0.13113
C  2.303412 -3.219679 -0.252873
C  1.042878 -4.00629 -0.598121
C  -5.326512 -1.132379 1.71228
H  0.837057 -0.533768 -1.593782
H  0.355851 1.06775 -2.19929
H  0.155572 2.944919 -0.446599
H  -1.970846 1.305577 -2.417736
H  -0.43038 -0.940767 0.955034
H  4.175594 0.841889 1.631223
H  1.586732 4.293161 1.093177
H  3.632175 3.24593 2.140651
H  -4.316631 0.916578 -1.600277
H  -2.747995 -1.324651 1.77752
H  3.081271 -3.29473 -1.034119
H  2.752004 -3.5326 0.707103
H  1.288203 -5.079952 -0.691889
H  0.277091 -3.891606 0.188036
H  0.610053 -3.663794 -1.553556
H  -4.876049 -0.651816 2.602992
H  -4.965981 -2.17706 1.634623
H  -6.422788 -1.125544 1.803046
