program: Gaussian 09
title: 000004260
version: EM64L-G09RevD.01
frameworkgroup: C1[X(C16H25NO3)]
method: RPBEPBE
basis: SDD
operation: Freq
keyword: #p
keyword: freq=noraman
keyword: PBEPBE/SDD
title: #p freq=noraman PBEPBE/SDD
converged: YES YES NO NO
title: Mulliken charges:
elementType: O O O N C C C C C C C C C C C C C C C C H H H H H H H H H H H H H H H H H H H H H H H H H
charge: -0.277067 -0.297940 -0.219152 -0.094791 -0.230222 0.448652 0.142754 -0.568878 -0.701439 -0.694426 0.376462 -0.560062 0.238480 -0.275627 -0.384507 -0.824778 -0.613927 -0.615030 0.242854 -0.748843 0.253176 0.252256 0.206959 0.211688 0.226773 0.229966 0.209279 0.211426 0.254261 0.204389 0.223365 0.224490 0.201350 0.222852 0.229430 0.267390 0.226816 0.192747 0.220291 0.229863 0.190437 0.222410 0.249302 0.246057 0.250511
chargesum: 0.00000
title: Mulliken charges with hydrogens summed into heavy atoms:
elementType: O O O N C C C C C C C C C C C C C C C C
charge: -0.277067 -0.297940 -0.219152 -0.094791 0.022954 0.448652 0.142754 -0.316621 -0.056019 -0.043755 0.376462 -0.305801 0.238480 0.152126 0.041333 -0.105105 0.025928 0.027680 0.242854 -0.002972
polarizability: 2.54945692e+02 -7.85373208e+00 1.99306466e+02 -3.63891732e+00 4.83631179e-01 1.39792048e+02
1716.lowfreq: -20.7356 -7.9637 -4.7395 -0.0005 0.0002 0.0009 4.4677 13.5114 25.7033
frequency: -20.7027 12.1562 25.6541 28.6343 41.0557 52.4758 63.2405 78.1191 94.0117 108.8344 126.1849 138.0818 150.9843 169.9290 192.5752 210.2256 215.3619 216.5803 225.5975 241.2030 247.8509 269.0329 289.0800 318.7387 328.2426 337.6278 379.6777 413.8990 420.5533 431.1891 461.7238 488.9318 503.4669 524.2086 558.8914 593.8649 597.8615 644.1449 704.6849 728.4720 744.3533 767.2673 812.4868 828.8038 856.2980 863.0767 886.2459 905.2899 919.5490 954.4351 967.1850 989.3376 1008.9596 1031.8732 1034.4988 1038.7727 1039.7693 1048.2363 1062.6520 1088.0762 1093.7403 1099.1503 1114.8224 1129.0989 1138.4193 1160.4855 1165.3067 1183.5738 1195.5857 1249.0858 1252.2690 1268.0914 1284.8727 1292.7310 1320.4279 1324.2570 1336.5885 1374.7746 1381.1804 1383.6592 1389.3406 1394.7718 1395.6355 1399.1038 1420.2749 1443.3037 1452.6763 1453.0122 1460.6399 1462.9065 1466.4146 1467.3339 1468.8798 1471.6147 1476.3914 1480.0801 1482.4262 1483.7097 1485.7791 1486.7269 1501.7828 1586.1101 1621.3771 1670.6438 2854.7889 2864.1739 2891.9339 2966.4288 2971.5860 2974.7966 2980.8752 3008.3697 3022.1963 3026.9220 3029.5553 3030.0961 3055.1483 3063.0623 3063.3248 3073.6969 3076.4353 3080.5963 3081.7715 3084.9783 3088.1652 3096.2706 3143.3960 3149.0135 3152.7978
redmass: 2.6316 2.6131 3.3526 1.2603 5.5970 3.7546 3.7966 2.5901 2.9536 3.8530 1.9532 1.2567 2.8777 3.8510 2.2578 1.9851 1.3027 1.2406 2.9793 1.3043 1.1498 2.8071 3.1437 4.4879 3.4934 3.0883 2.5904 2.8718 3.2226 2.7913 3.3299 3.4002 3.5094 4.4831 3.0878 4.3114 5.1298 4.8267 5.1838 5.9481 3.0333 4.0219 1.6853 2.1958 1.4579 4.2678 2.6695 1.5604 1.1990 1.4245 5.5627 1.9839 1.5378 2.3752 1.5888 1.7006 2.3080 1.5218 1.6170 1.4252 2.1063 2.1389 2.7257 3.3625 1.4417 2.1981 1.4281 3.0928 1.8979 1.7188 1.5348 2.5047 2.9721 1.3549 1.6487 1.3158 1.5187 1.2091 1.5315 2.0017 1.4942 1.3889 2.0033 1.6316 1.1440 1.1640 1.0545 1.0527 1.0461 1.0541 1.0463 1.0552 1.0657 1.1054 1.0638 1.0554 1.1701 1.1138 1.0598 1.0743 2.4020 7.0642 7.4842 9.8348 1.0565 1.0577 1.0689 1.0564 1.0348 1.0353 1.0364 1.0367 1.0732 1.0792 1.0925 1.0856 1.0976 1.0977 1.0999 1.0981 1.1004 1.1008 1.0990 1.1006 1.0995 1.0973 1.1012 1.0907 1.0908
irintensity: 0.0241 0.7191 0.5938 1.7259 0.0666 0.8146 0.6946 2.1535 3.5653 0.2564 1.7597 0.8624 0.5981 4.2341 1.0416 0.3046 1.4898 0.8787 0.1119 1.4319 0.2974 0.7527 2.8982 0.6079 2.1401 6.3181 2.4258 1.2422 2.1436 1.4950 9.0314 3.8231 3.1046 25.0917 2.2242 0.4009 4.7078 0.5710 2.6745 2.0543 1.2312 6.9862 21.6252 13.6157 14.2331 47.4847 3.5818 29.5666 1.0604 0.3361 55.4117 114.8996 37.3951 20.2055 23.8534 5.8295 91.8201 10.2230 6.3607 14.8063 3.4874 14.0498 2.5524 181.7258 2.0921 362.2015 0.7334 188.7409 13.4890 18.1249 33.5688 12.4003 35.8199 4.7640 26.3824 2.7139 4.4785 16.2093 93.2194 2.6341 8.3213 14.8837 4.4375 33.1526 2.6714 4.4956 25.1248 22.1157 11.4467 15.3279 0.0255 10.4692 4.1279 31.1983 8.6264 21.2467 6.6845 46.1672 11.4341 20.5732 102.6114 5.4770 19.6770 156.3979 68.9447 168.9150 104.5287 40.6217 31.9209 40.0327 26.3791 2.6225 36.4839 47.5227 14.2829 0.3799 37.1501 11.2696 0.5768 99.9461 23.5604 32.2847 41.4699 55.8420 20.6853 6.6807 11.3956 14.5291 4.8610
temp: 298.150 k
press: 1.00000 atm
elementType: 8 8 8 7 6 6 6 6 6 6 6 6 6 6 6 6 6 6 6 6 1 1 1 1 1 1 1 1 1 1 1 1 1 1 1 1 1 1 1 1 1 1 1 1 1
symmnumber: 1
zpe: 995769.4 jmol-1
zpe.correction: 0.379269 hartree
zpe.thermalcorrener: 0.402273 hartree
zpe.thermalcorrenthalpy: 0.403217 hartree
zpe.thermalcorrgfe: 0.324187 hartree
zpe.sumelectzpe: -903.546085 hartree
zpe.sumelectthermal: -903.523080 hartree
zpe.sumelectthermalent: -903.522136 hartree
zpe.sumelectthermalfe: -903.601166 hartree
dipole: -1.6318 -0.1473 -1.7637
dipole: 2.4073
quadrupole: -97.0178 -117.1107 -128.3483
quadrupole: 1.5656 -5.5390 5.2369
quadrupole: 17.1412 -2.9518 -14.1894 1.5656 -5.5390 5.2369
hfenergy: -903.9253531 hartree
pointgroup: C01 [X(C16H25N1O3)]
dipole: 0.6292231 0.1408594 -0.6936915 debye
polarizability: 255.0156381|-8.0737047|198.5606505|0.5600424|6.7440081|140.467918 unknown
InChI: InChI=1S/C16H25NO3/c1-11(2)14-10-15(20-13(4)18)12(3)9-16(14)19-8-7-17(5)6/h9-11H,7-8H2,1-6H3
charge 0 multiplicity 1
45 atoms
O  1.810217 -0.48449 -0.127496
O  -3.733478 0.466927 -0.530089
O  -4.066532 1.117746 1.702133
N  5.197488 1.047404 0.204477
C  0.0981 -2.72704 -0.458506
C  -0.43686 -1.295315 -0.380607
C  0.436739 -0.181709 -0.206172
C  -1.819549 -1.022515 -0.453341
C  -0.372348 -3.453274 -1.745614
C  -0.299218 -3.53359 0.808215
C  -1.457971 1.405333 -0.197493
C  -0.068964 1.138547 -0.12377
C  -2.311819 0.291559 -0.357626
C  2.757432 0.628998 0.044644
C  4.154817 -0.00208 0.126763
C  -1.989345 2.821164 -0.103997
C  5.535979 1.626498 -1.112209
C  6.402555 0.615559 0.941252
C  -4.52539 0.876443 0.569306
C  -5.972736 0.965065 0.136691
H  1.200288 -2.665232 -0.485901
H  -2.53592 -1.839662 -0.588146
H  -1.472071 -3.57138 -1.766455
H  0.072903 -4.464273 -1.79983
H  -0.074391 -2.894895 -2.651343
H  0.069442 -3.040448 1.725431
H  0.126424 -4.553901 0.767323
H  -1.39849 -3.625878 0.892126
H  0.611357 1.985836 0.004088
H  2.676778 1.324775 -0.815306
H  2.537639 1.18619 0.975919
H  4.201281 -0.622801 1.039352
H  4.297235 -0.688954 -0.743069
H  -1.179659 3.557831 -0.239789
H  -2.762483 3.012659 -0.870488
H  -2.45462 2.997042 0.883609
H  6.224666 2.479272 -0.975808
H  6.024948 0.890668 -1.800339
H  4.628238 2.006291 -1.612047
H  6.121926 0.279965 1.955008
H  6.959199 -0.216481 0.440142
H  7.095408 1.469998 1.046293
H  -6.078348 1.689875 -0.689095
H  -6.596348 1.274861 0.987321
H  -6.314824 -0.013288 -0.242558
