program: Gaussian 09
title: 000227419
version: EM64L-G09RevD.01
frameworkgroup: C1[X(C10H20O)]
method: RPBEPBE
basis: SDD
operation: Freq
keyword: #pfreq=noraman
keyword: PBEPBE/SDD
title: #p freq=noraman PBEPBE/SDD
converged: YES YES NO NO
title: Mulliken charges:
elementType: O C C C C C C C C C C H H H H H H H H H H H H H H H H H H H H
charge: -0.438582 -0.006597 -0.016986 -0.463319 -0.419210 -0.398564 -0.414353 -0.392105 -0.468690 -0.742976 -0.336721 0.191165 0.190642 0.195232 0.209672 0.193279 0.188034 0.191001 0.185671 0.195805 0.185590 0.189403 0.196961 0.225236 0.182603 0.213242 0.212943 0.209517 0.236058 0.178962 0.327086
chargesum: 0.00000
title: Mulliken charges with hydrogens summed into heavy atoms:
elementType: O C C C C C C C C C C
charge: -0.111496 0.184568 0.173656 -0.058415 -0.037897 -0.021892 -0.032958 -0.005740 -0.060851 -0.107274 0.078300
polarizability: 1.29610292e+02 -3.08881340e+00 1.04778274e+02 -7.91503653e-01 -2.47829062e-01 9.15124790e+01
1716.lowfreq: -23.9829 -13.2233 -0.0007 -0.0002 0.0004 18.6034 50.3130 93.9232 96.1616
frequency: 49.8050 93.8328 96.0150 119.3397 167.6355 208.5388 226.6367 265.2822 281.0581 283.6395 311.9956 324.1116 376.3114 389.8555 436.0798 471.1362 526.8682 551.0556 712.4373 776.7554 804.0476 820.0399 824.4483 896.8080 908.8857 928.3405 954.3974 955.6583 972.1573 1018.5603 1035.1351 1044.6119 1056.2068 1065.7446 1079.8602 1103.2705 1123.6214 1141.1219 1163.4896 1197.9710 1202.9490 1227.7494 1251.0325 1254.5191 1277.6391 1285.1644 1290.8199 1313.7774 1317.3385 1327.0696 1332.9852 1341.0419 1343.9373 1350.5668 1362.3537 1367.6878 1386.7415 1388.8158 1457.2245 1459.3494 1462.3490 1465.0960 1475.5038 1478.9176 1479.3735 1482.0879 1483.6302 2935.4470 2937.5399 2939.5300 2947.4199 2949.2234 2956.9669 2961.2939 2964.0468 2966.2079 2971.7830 3004.9524 3011.1895 3015.1701 3019.5470 3021.5047 3027.2703 3059.1475 3065.6442 3085.3967 3554.3424
redmass: 3.5660 2.1220 2.5261 3.0554 2.6472 1.1412 2.0904 2.3152 2.2239 2.4242 2.6361 1.2661 1.9941 2.7158 2.3806 2.0667 2.2352 2.3816 2.3689 1.5665 1.5959 1.8669 1.5949 1.8364 1.9579 1.4911 3.3650 1.6011 1.8331 2.4293 2.3172 1.4110 2.9012 2.1789 1.7684 1.8001 1.3453 2.0408 1.8987 1.8123 1.2974 1.2312 1.3221 1.2087 1.1444 1.2045 1.2079 1.2478 1.3279 1.3321 1.3470 1.4495 1.4501 1.5036 1.4521 1.4180 1.2327 1.2201 1.0859 1.0823 1.0830 1.0851 1.0482 1.0625 1.0787 1.0832 1.0824 1.0803 1.0797 1.0709 1.0629 1.0628 1.0618 1.0587 1.0621 1.0405 1.0650 1.0996 1.1012 1.0974 1.0979 1.0989 1.0988 1.0988 1.0994 1.0942 1.0661
irintensity: 0.7066 2.0355 2.4823 2.3634 0.8035 0.1475 0.4464 6.1167 6.1582 0.3311 9.0690 136.0413 1.8698 7.2209 2.1393 3.6177 3.2882 0.0451 0.1577 3.9919 1.3543 1.6489 4.2021 3.9525 3.3210 1.4175 82.0733 27.1561 6.4172 4.1228 6.8701 6.6440 14.1934 4.0368 3.8807 3.8204 18.5688 0.9828 1.8847 5.3650 1.1860 1.3529 10.5043 6.2866 1.0114 1.9760 0.3035 2.4129 0.2957 0.9866 0.5105 2.6984 1.0054 0.5592 1.5661 0.6474 29.5716 3.2106 2.2578 2.4516 7.2917 8.8538 7.5592 12.4122 1.1845 5.6327 26.1582 9.0287 3.7719 70.1544 35.1766 37.0978 39.5940 11.6717 39.6974 72.7350 19.6502 41.6340 37.3032 67.3892 53.9637 46.4122 106.7918 65.5587 46.5912 38.5618 5.6829
temp: 298.150 k
press: 1.00000 atm
elementType: 8 6 6 6 6 6 6 6 6 6 6 1 1 1 1 1 1 1 1 1 1 1 1 1 1 1 1 1 1 1 1
symmnumber: 1
zpe: 741817.0 jmol-1
zpe.correction: 0.282543 hartree
zpe.thermalcorrener: 0.295027 hartree
zpe.thermalcorrenthalpy: 0.295971 hartree
zpe.thermalcorrgfe: 0.244351 hartree
zpe.sumelectzpe: -467.349318 hartree
zpe.sumelectthermal: -467.336834 hartree
zpe.sumelectthermalent: -467.335890 hartree
zpe.sumelectthermalfe: -467.387509 hartree
dipole: 1.1988 1.1104 1.4725
dipole: 2.1996
quadrupole: -78.4980 -70.0861 -71.7619
quadrupole: -6.4409 -7.3668 -0.6843
quadrupole: -5.0493 3.3625 1.6868 -6.4409 -7.3668 -0.6843
hfenergy: -467.6318608 hartree
pointgroup: C01 [X(C10H20O1)]
dipole: 0.4769199 0.4421424 0.5709214 debye
polarizability: 129.5239091|-3.4374216|104.8509274|-0.6867621|-0.5117358|91.5262085 unknown
InChI: InChI=1S/C10H20O/c1-9-3-2-4-10(6-5-9)7-8-11/h9-11H,2-8H2,1H3
charge 0 multiplicity 1
31 atoms
O  -4.451815 -0.364528 -0.690384
C  -0.868474 0.212788 0.743635
C  2.327209 -0.53764 -0.431272
C  -0.151832 -1.057246 0.194228
C  0.029933 1.484601 0.763081
C  1.345463 -1.220095 0.563484
C  2.316942 1.012236 -0.365915
C  0.933872 1.700196 -0.480298
C  -2.185247 0.48188 -0.039098
C  3.767629 -1.062719 -0.219611
C  -3.193771 -0.680687 0.010419
H  -1.148974 0.006531 1.800876
H  2.002309 -0.833305 -1.453351
H  -0.239221 -1.069654 -0.91287
H  -0.709931 -1.946222 0.549337
H  0.684066 1.458657 1.658126
H  -0.631998 2.364048 0.899498
H  1.534776 -0.848891 1.592402
H  1.587986 -2.302139 0.579722
H  2.978104 1.392078 -1.172149
H  2.78453 1.328654 0.591456
H  1.106205 2.78749 -0.608174
H  0.414216 1.364242 -1.400871
H  -1.956285 0.709999 -1.099445
H  -2.672014 1.387269 0.385123
H  3.82126 -2.158256 -0.3627
H  4.476583 -0.592124 -0.926675
H  4.119176 -0.838974 0.806539
H  -2.812973 -1.568309 -0.519507
H  -3.39421 -0.964078 1.068073
H  -4.83231 0.462197 -0.298078
